BDBM50089557 5-[Butyl-((E)-6,6-dimethyl-hept-2-en-4-ynyl)-amino]-3,4-dihydro-1H-quinolin-2-one::CHEMBL285056
SMILES: CCCCN(C\C=C\C#CC(C)(C)C)c1cccc2NC(=O)CCc12
InChI Key: InChIKey=JAFCGPYJCLICIG-VQHVLOKHSA-N
Data: 2 IC50
Activity Spreadsheet -- Enzyme Inhibition Constant Data from BindingDB
Found 2 hits for monomerid = 50089557
Trg + Lig
Ki
nM
ΔG°
kcal/mole
IC50
nM
Kd
nM
EC50/IC50
nM
koff
s-1
kon
M-1s-1
pHTemp
°C
Chitin synthase 3
(Candida albicans)
BDBM50089557
(5-[Butyl-((E)-6,6-dimethyl-hept-2-en-4-ynyl)-amino...)
Show SMILES CCCCN(C\C=C\C#CC(C)(C)C)c1cccc2NC(=O)CCc12
Show InChI InChI=1S/C22H30N2O/c1-5-6-16-24(17-9-7-8-15-22(2,3)4)20-12-10-11-19-18(20)13-14-21(25)23-19/h7,9-12H,5-6,13-14,16-17H2,1-4H3,(H,23,25)/b9-7+
Reactome pathway
n/an/a 1.04E+3n/an/an/an/an/an/a
TBA
Assay Description
Inhibition of Candida albicans chitin synthase
Citation and Details
Article DOI: 10.1007/s00044-012-0177-9
BindingDB Entry DOI: 10.7270/Q21N8422
Chitin synthase
(Candida albicans)
BDBM50089557
(5-[Butyl-((E)-6,6-dimethyl-hept-2-en-4-ynyl)-amino...)
Show SMILES CCCCN(C\C=C\C#CC(C)(C)C)c1cccc2NC(=O)CCc12
Show InChI InChI=1S/C22H30N2O/c1-5-6-16-24(17-9-7-8-15-22(2,3)4)20-12-10-11-19-18(20)13-14-21(25)23-19/h7,9-12H,5-6,13-14,16-17H2,1-4H3,(H,23,25)/b9-7+
n/an/a 0.350n/an/an/an/an/an/a
Nippon Roche Research Center
Curated by ChEMBL
Assay Description
Inhibitory of Candida albicans chitin synthase 1
Bioorg Med Chem Lett 10: 1459-62 (2000)
BindingDB Entry DOI: 10.7270/Q2R210MK