BDBM50089563 5-[((E)-6,6-Dimethyl-hept-2-en-4-ynyl)-ethyl-amino]-3,4-dihydro-1H-quinolin-2-one::CHEMBL36446
SMILES: CCN(C\C=C\C#CC(C)(C)C)c1cccc2NC(=O)CCc12
InChI Key: InChIKey=ZIZKDDDDUBHGRJ-SOFGYWHQSA-N
Data: 2 IC50
Activity Spreadsheet -- Enzyme Inhibition Constant Data from BindingDB
Found 2 hits for monomerid = 50089563
Trg + Lig
Ki
nM
ΔG°
kcal/mole
IC50
nM
Kd
nM
EC50/IC50
nM
koff
s-1
kon
M-1s-1
pHTemp
°C
Chitin synthase 3
(Candida albicans)
BDBM50089563
(5-[((E)-6,6-Dimethyl-hept-2-en-4-ynyl)-ethyl-amino...)
Show SMILES CCN(C\C=C\C#CC(C)(C)C)c1cccc2NC(=O)CCc12
Show InChI InChI=1S/C20H26N2O/c1-5-22(15-8-6-7-14-20(2,3)4)18-11-9-10-17-16(18)12-13-19(23)21-17/h6,8-11H,5,12-13,15H2,1-4H3,(H,21,23)/b8-6+
Reactome pathway
n/an/a 2.90E+3n/an/an/an/an/an/a
TBA
Assay Description
Inhibition of Candida albicans chitin synthase
Citation and Details
Article DOI: 10.1007/s00044-012-0177-9
BindingDB Entry DOI: 10.7270/Q21N8422
Chitin synthase
(Candida albicans)
BDBM50089563
(5-[((E)-6,6-Dimethyl-hept-2-en-4-ynyl)-ethyl-amino...)
Show SMILES CCN(C\C=C\C#CC(C)(C)C)c1cccc2NC(=O)CCc12
Show InChI InChI=1S/C20H26N2O/c1-5-22(15-8-6-7-14-20(2,3)4)18-11-9-10-17-16(18)12-13-19(23)21-17/h6,8-11H,5,12-13,15H2,1-4H3,(H,21,23)/b8-6+
n/an/a 0.900n/an/an/an/an/an/a
Nippon Roche Research Center
Curated by ChEMBL
Assay Description
Inhibitory of Candida albicans chitin synthase 1
Bioorg Med Chem Lett 10: 1459-62 (2000)
BindingDB Entry DOI: 10.7270/Q2R210MK