BDBM50089677 CHEMBL3577318
SMILES: CC(C)c1nc(N)nc(N)c1-c1ccc(Cl)cc1
InChI Key: InChIKey=KGYSRPLLVJNNKG-UHFFFAOYSA-N
Data: 1 IC50
Activity Spreadsheet -- Enzyme Inhibition Constant Data from BindingDB
Found 1 hit for monomerid = 50089677
Trg + Lig
Ki
nM
ΔG°
kcal/mole
IC50
nM
Kd
nM
EC50/IC50
nM
koff
s-1
kon
M-1s-1
pHTemp
°C
Beta-hexosaminidase subunit alpha (HexA)
(Homo sapiens (Human))
BDBM50089677
(CHEMBL3577318)
Show SMILES CC(C)c1nc(N)nc(N)c1-c1ccc(Cl)cc1
Show InChI InChI=1S/C13H15ClN4/c1-7(2)11-10(12(15)18-13(16)17-11)8-3-5-9(14)6-4-8/h3-7H,1-2H3,(H4,15,16,17,18)
Reactome pathway
n/an/a>4.10E+5n/an/an/an/an/an/a
Genetics and Genome Biology, SickKids, PGCRL 686 Bay Street, Toronto, Ontario M5G 0A4, Canada.
Curated by ChEMBL
Assay Description
Inhibition of human placental HexA using pNPGlcNAc substrate
J Med Chem 58: 4483-93 (2015)
Article DOI: 10.1021/jm5017895
BindingDB Entry DOI: 10.7270/Q28054CK