BDBM50089679 CHEMBL3577320
SMILES: NCc1nc(N)nc(N)c1-c1ccc(Cl)cc1
InChI Key: InChIKey=XLDXTROHOWXTIJ-UHFFFAOYSA-N
Data: 1 IC50
Activity Spreadsheet -- Enzyme Inhibition Constant Data from BindingDB
Found 1 hit for monomerid = 50089679
Trg + Lig
Ki
nM
ΔG°
kcal/mole
IC50
nM
Kd
nM
EC50/IC50
nM
koff
s-1
kon
M-1s-1
pHTemp
°C
Beta-hexosaminidase subunit alpha (HexA)
(Homo sapiens (Human))
BDBM50089679
(CHEMBL3577320)
Show SMILES NCc1nc(N)nc(N)c1-c1ccc(Cl)cc1
Show InChI InChI=1S/C11H12ClN5/c12-7-3-1-6(2-4-7)9-8(5-13)16-11(15)17-10(9)14/h1-4H,5,13H2,(H4,14,15,16,17)
Reactome pathway
n/an/a 1.80E+5n/an/an/an/an/an/a
Genetics and Genome Biology, SickKids, PGCRL 686 Bay Street, Toronto, Ontario M5G 0A4, Canada.
Curated by ChEMBL
Assay Description
Inhibition of human placental HexA using pNPGlcNAc substrate
J Med Chem 58: 4483-93 (2015)
Article DOI: 10.1021/jm5017895
BindingDB Entry DOI: 10.7270/Q28054CK