BDBM50089952 CHEMBL3581176
SMILES: OC1=C(Sc2ccccc2Cl)C(=O)CC(C1)c1c(Cl)ccc(N2CCN(CC2)C2COC2)c1Cl
InChI Key: InChIKey=KSOBRLFTYCYMBG-UHFFFAOYSA-N
Data: 1 IC50
Activity Spreadsheet -- Enzyme Inhibition Constant Data from BindingDB
Found 1 hit for monomerid = 50089952
Trg + Lig
Ki
nM
ΔG°
kcal/mole
IC50
nM
Kd
nM
EC50/IC50
nM
koff
s-1
kon
M-1s-1
pHTemp
°C
Lactate dehydrogenase A (LDHA)
(Homo sapiens (Human))
BDBM50089952
(CHEMBL3581176)
Show SMILES OC1=C(Sc2ccccc2Cl)C(=O)CC(C1)c1c(Cl)ccc(N2CCN(CC2)C2COC2)c1Cl |c:1|
Show InChI InChI=1S/C25H25Cl3N2O3S/c26-17-3-1-2-4-22(17)34-25-20(31)11-15(12-21(25)32)23-18(27)5-6-19(24(23)28)30-9-7-29(8-10-30)16-13-33-14-16/h1-6,15-16,31H,7-14H2
Reactome pathway
n/an/a 370n/an/an/an/an/an/a
Genentech
Curated by ChEMBL
Assay Description
Inhibition of human LDH-A by biochemical assay
Bioorg Med Chem Lett 25: 75-82 (2015)
Article DOI: 10.1016/j.bmcl.2014.11.008
BindingDB Entry DOI: 10.7270/Q2BR8TXC