BDBM50090110 (S)-2-(4-Hydroxy-benzylamino)-3-phenyl-propionic acid tert-butyl ester::CHEMBL36487
SMILES: CC(C)(C)OC(=O)[C@H](Cc1ccccc1)NCc1ccc(O)cc1
InChI Key: InChIKey=SBKVYOUYJNISOH-SFHVURJKSA-N
Data: 1 IC50
Activity Spreadsheet -- Enzyme Inhibition Constant Data from BindingDB
Found 1 hit for monomerid = 50090110
Trg + Lig
Ki
nM
ΔG°
kcal/mole
IC50
nM
Kd
nM
EC50/IC50
nM
koff
s-1
kon
M-1s-1
pHTemp
°C
Integrin α4β7
(Homo sapiens (Human))
BDBM50090110
((S)-2-(4-Hydroxy-benzylamino)-3-phenyl-propionic a...)
Show SMILES CC(C)(C)OC(=O)[C@H](Cc1ccccc1)NCc1ccc(O)cc1
Show InChI InChI=1S/C20H25NO3/c1-20(2,3)24-19(23)18(13-15-7-5-4-6-8-15)21-14-16-9-11-17(22)12-10-16/h4-12,18,21-22H,13-14H2,1-3H3/t18-/m0/s1
NCI pathway
Reactome pathway
n/an/a 8.50E+4n/an/an/an/an/an/a
Millennium Pharmaceutical
Curated by ChEMBL
Assay Description
Inhibition of alpha-4 beta7/MAdCAM mediated cell adhesion was evaluated using B-cell lymphoma RPMI 8866 cells
Bioorg Med Chem Lett 10: 1497-9 (2000)
BindingDB Entry DOI: 10.7270/Q2DN4493