BDBM50090421 2-(Furan-2-carbonyl)-4-(3-methyl-2,5-dioxo-2,5-dihydro-pyrrol-1-ylamino)-pyrimidine-5-carboxylic acid ethyl ester::CHEMBL43251::ethyl 2-(furan-2-carbonyl)-4-(3-methyl-2,5-dioxo-2H-pyrrol-1(5H)-ylamino)pyrimidine-5-carboxylate
SMILES: CCOC(=O)c1cnc(nc1NN1C(=O)C=C(C)C1=O)C(=O)c1ccco1
InChI Key: InChIKey=DSYPQICAGKUAFT-UHFFFAOYSA-N
Data: 1 IC50
Activity Spreadsheet -- Enzyme Inhibition Constant Data from BindingDB
Found 1 hit for monomerid = 50090421
Trg + Lig
Ki
nM
ΔG°
kcal/mole
IC50
nM
Kd
nM
EC50/IC50
nM
koff
s-1
kon
M-1s-1
pHTemp
°C
Proto-oncogene c-JUN/protein c-fos
(Homo sapiens (Human))
BDBM50090421
(2-(Furan-2-carbonyl)-4-(3-methyl-2,5-dioxo-2,5-dih...)
Show SMILES CCOC(=O)c1cnc(nc1NN1C(=O)C=C(C)C1=O)C(=O)c1ccco1 |t:16|
Show InChI InChI=1S/C17H14N4O6/c1-3-26-17(25)10-8-18-15(13(23)11-5-4-6-27-11)19-14(10)20-21-12(22)7-9(2)16(21)24/h4-8H,3H2,1-2H3,(H,18,19,20)
n/an/a 700n/an/an/an/an/an/a
Signal Pharmaceuticals, Inc.
Curated by ChEMBL
Assay Description
Inhibition of AP-1 (activator protein-1) mediated transcriptional activation in Jurkat T-cells
Bioorg Med Chem Lett 10: 1645-8 (2000)
BindingDB Entry DOI: 10.7270/Q2F190XH