BDBM50090437 2-Cyclohex-1-enylmethyl-4-(3-methyl-2,5-dioxo-2,5-dihydro-pyrrol-1-ylamino)-pyrimidine-5-carboxylic acid ethyl ester::CHEMBL43388::ethyl 2-(cyclohexenylmethyl)-4-(3-methyl-2,5-dioxo-2H-pyrrol-1(5H)-ylamino)pyrimidine-5-carboxylate
SMILES: CCOC(=O)c1cnc(CC2=CCCCC2)nc1NN1C(=O)C=C(C)C1=O
InChI Key: InChIKey=UDZVQXOVPIBUJT-UHFFFAOYSA-N
Data: 1 IC50
Activity Spreadsheet -- Enzyme Inhibition Constant Data from BindingDB
Found 1 hit for monomerid = 50090437
Trg + Lig
Ki
nM
ΔG°
kcal/mole
IC50
nM
Kd
nM
EC50/IC50
nM
koff
s-1
kon
M-1s-1
pHTemp
°C
Proto-oncogene c-JUN/protein c-fos
(Homo sapiens (Human))
BDBM50090437
(2-Cyclohex-1-enylmethyl-4-(3-methyl-2,5-dioxo-2,5-...)
Show SMILES CCOC(=O)c1cnc(CC2=CCCCC2)nc1NN1C(=O)C=C(C)C1=O |t:10,24|
Show InChI InChI=1S/C19H22N4O4/c1-3-27-19(26)14-11-20-15(10-13-7-5-4-6-8-13)21-17(14)22-23-16(24)9-12(2)18(23)25/h7,9,11H,3-6,8,10H2,1-2H3,(H,20,21,22)
n/an/a 2.00E+3n/an/an/an/an/an/a
Signal Pharmaceuticals, Inc.
Curated by ChEMBL
Assay Description
Inhibition of AP-1 (activator protein-1) mediated transcriptional activation in Jurkat T-cells
Bioorg Med Chem Lett 10: 1645-8 (2000)
BindingDB Entry DOI: 10.7270/Q2F190XH