BDBM50090504 CHEMBL3581714
SMILES: [H][C@@]1(CC[C@]2(C)[C@]1([H])[C@H](O)C[C@]1([H])[C@@]3(C)C[C@@H](O)[C@H](O)C(C)(C)[C@]3([H])CC[C@@]21C)[C@](C)(C\C=C\C(C)C)O[C@@H]1O[C@H](CO[C@@H]2O[C@@H](C)[C@H](O)[C@@H](O)[C@H]2O)[C@@H](O)[C@H](O)[C@H]1O
InChI Key: InChIKey=CRSVPTGHDKPMFM-AQQDXXBISA-M
Data: 1 IC50
Activity Spreadsheet -- Enzyme Inhibition Constant Data from BindingDB
Found 1 hit for monomerid = 50090504
Trg + Lig
Ki
nM
ΔG°
kcal/mole
IC50
nM
Kd
nM
EC50/IC50
nM
koff
s-1
kon
M-1s-1
pHTemp
°C
Signal transducer and activator of transcription 3
(Homo sapiens (Human))
BDBM50090504
(CHEMBL3581714)
Show SMILES [H][C@@]1(CC[C@]2(C)[C@]1([H])[C@H](O)C[C@]1([H])[C@@]3(C)C[C@@H](O)[C@H](O)C(C)(C)[C@]3([H])CC[C@@]21C)[C@](C)(C\C=C\C(C)C)O[C@@H]1O[C@H](CO[C@@H]2O[C@@H](C)[C@H](O)[C@@H](O)[C@H]2O)[C@@H](O)[C@H](O)[C@H]1O |r|
Show InChI InChI=1S/C19H29O9P.Na/c1-19(23,12-11-16-9-7-10-18(22)27-16)17(28-29(24,25)26)14-15(21)8-5-3-2-4-6-13-20;/h2-4,6-7,10-12,15-17,20-21,23H,5,8-9,13-14H2,1H3,(H2,24,25,26);/q;+1/p-1/b3-2-,6-4+,12-11+;/t15-,16+,17+,19+;/m0./s1
n/an/a 500n/an/an/an/an/an/a
Chungbuk National University
Curated by ChEMBL
Assay Description
Inhibition of IL6-induced STAT3 activation in human Hep3B cells after 12 hrs by luciferase assay
J Nat Prod 78: 971-6 (2015)
Article DOI: 10.1021/np500803e
BindingDB Entry DOI: 10.7270/Q22B90SD