BDBM50091040 CHEMBL3582119
SMILES: CC1(C)Nc2c3CCCc3c(cc2C(C)(C)C1=O)-c1cccc2nccn12
InChI Key: InChIKey=ZJMHBSMHAVKZSY-KEVXWDJXSA-N
Data: 3 KI  1 IC50
Activity Spreadsheet -- Enzyme Inhibition Constant Data from BindingDB
Found 4 hits for monomerid = 50091040
Trg + Lig
Ki
nM
ΔG°
kcal/mole
IC50
nM
Kd
nM
EC50/IC50
nM
koff
s-1
kon
M-1s-1
pHTemp
°C
Glucocorticoid receptor
(Homo sapiens (Human))
BDBM50091040
(CHEMBL3582119)
Show SMILES CC1(C)Nc2c3CCCc3c(cc2C(C)(C)C1=O)-c1cccc2nccn12
Show InChI InChI=1S/C29H59O11P/c1-3-4-5-6-7-8-9-10-11-12-13-14-15-16-17-18-19-38-21-23(37-2)22-39-41(35,36)40-29-26(32)24(20-30)25(31)27(33)28(29)34/h23-34H,3-22H2,1-2H3,(H,35,36)/t23-,24-,25?,26?,27?,28?,29?/m1/s1
11n/an/an/an/an/an/an/an/a
TBA
Curated by ChEMBL
Assay Description
Displacement of [3H]-dexamethasone from cytosolic fraction of human recombinant glucocorticoid receptor by scintillation counting analysis
J Med Chem 58: 4918-26 (2015)
Article DOI: 10.1021/jm501758q
BindingDB Entry DOI: 10.7270/Q2WM1G4V
Mineralocorticoid receptor
(Homo sapiens (Human))
BDBM50091040
(CHEMBL3582119)
Show SMILES CC1(C)Nc2c3CCCc3c(cc2C(C)(C)C1=O)-c1cccc2nccn12
Show InChI InChI=1S/C29H59O11P/c1-3-4-5-6-7-8-9-10-11-12-13-14-15-16-17-18-19-38-21-23(37-2)22-39-41(35,36)40-29-26(32)24(20-30)25(31)27(33)28(29)34/h23-34H,3-22H2,1-2H3,(H,35,36)/t23-,24-,25?,26?,27?,28?,29?/m1/s1
>1.00E+3n/an/an/an/an/an/an/an/a
TBA
Curated by ChEMBL
Assay Description
Displacement of [3H]-aldosterone from cytosolic fraction of human recombinant mineralocorticoid receptor by scintillation counting analysis
J Med Chem 58: 4918-26 (2015)
Article DOI: 10.1021/jm501758q
BindingDB Entry DOI: 10.7270/Q2WM1G4V
Progesterone receptor
(Homo sapiens (Human))
BDBM50091040
(CHEMBL3582119)
Show SMILES CC1(C)Nc2c3CCCc3c(cc2C(C)(C)C1=O)-c1cccc2nccn12
Show InChI InChI=1S/C29H59O11P/c1-3-4-5-6-7-8-9-10-11-12-13-14-15-16-17-18-19-38-21-23(37-2)22-39-41(35,36)40-29-26(32)24(20-30)25(31)27(33)28(29)34/h23-34H,3-22H2,1-2H3,(H,35,36)/t23-,24-,25?,26?,27?,28?,29?/m1/s1
>1.25E+3n/an/an/an/an/an/an/an/a
TBA
Curated by ChEMBL
Assay Description
Displacement of [3H]-progesterone from cytosolic fraction of human recombinant progesterone-B receptor by scintillation counting analysis
J Med Chem 58: 4918-26 (2015)
Article DOI: 10.1021/jm501758q
BindingDB Entry DOI: 10.7270/Q2WM1G4V
Glucocorticoid receptor
(Homo sapiens (Human))
BDBM50091040
(CHEMBL3582119)
Show SMILES CC1(C)Nc2c3CCCc3c(cc2C(C)(C)C1=O)-c1cccc2nccn12
Show InChI InChI=1S/C29H59O11P/c1-3-4-5-6-7-8-9-10-11-12-13-14-15-16-17-18-19-38-21-23(37-2)22-39-41(35,36)40-29-26(32)24(20-30)25(31)27(33)28(29)34/h23-34H,3-22H2,1-2H3,(H,35,36)/t23-,24-,25?,26?,27?,28?,29?/m1/s1
n/an/a 21n/an/an/an/an/an/a
TBA
Curated by ChEMBL
Assay Description
Antagonist activity at human glucocorticoid receptor transfected in CHOK1 cells assessed as inhibition of dexamethasone-induced receptor transcriptio...
J Med Chem 58: 4918-26 (2015)
Article DOI: 10.1021/jm501758q
BindingDB Entry DOI: 10.7270/Q2WM1G4V