BDBM50091041 CHEMBL3582116
SMILES: Cc1ncn(C)c1-c1cc2c(NC(C)(C)C(=O)C2(C)C)c2CCCc12
InChI Key: InChIKey=UEXZLIHDHZAEEC-KLOZGLDBSA-N
Data: 1 KI  1 IC50
Activity Spreadsheet -- Enzyme Inhibition Constant Data from BindingDB
Found 2 hits for monomerid = 50091041
Trg + Lig
Ki
nM
ΔG°
kcal/mole
IC50
nM
Kd
nM
EC50/IC50
nM
koff
s-1
kon
M-1s-1
pHTemp
°C
Glucocorticoid receptor
(Homo sapiens (Human))
BDBM50091041
(CHEMBL3582116)
Show SMILES Cc1ncn(C)c1-c1cc2c(NC(C)(C)C(=O)C2(C)C)c2CCCc12 |(4.97,-.35,;4.72,-1.55,;5.75,-2.7,;4.97,-4.04,;3.46,-3.71,;2.54,-4.53,;3.33,-2.19,;2,-1.4,;.66,-2.11,;-.68,-1.4,;-.68,.15,;-2,.93,;-3.36,.15,;-4.42,-.49,;-3.33,1.38,;-3.36,-1.4,;-4.42,-2.03,;-2,-2.11,;-.91,-2.7,;-3.08,-2.71,;.66,.93,;.98,2.44,;2.53,2.61,;3.17,1.19,;2,.15,)|
Show InChI InChI=1S/C29H56O9/c1-3-4-5-6-7-8-9-10-11-12-13-14-15-16-17-18-19-36-21-23(35-2)22-37-29(34)38-28-25(31)20-24(30)26(32)27(28)33/h23-28,30-33H,3-22H2,1-2H3/t23-,24?,25?,26?,27?,28?/m1/s1
69n/an/an/an/an/an/an/an/a
TBA
Curated by ChEMBL
Assay Description
Displacement of [3H]-dexamethasone from cytosolic fraction of human recombinant glucocorticoid receptor by scintillation counting analysis
J Med Chem 58: 4918-26 (2015)
Article DOI: 10.1021/jm501758q
BindingDB Entry DOI: 10.7270/Q2WM1G4V
Glucocorticoid receptor
(Homo sapiens (Human))
BDBM50091041
(CHEMBL3582116)
Show SMILES Cc1ncn(C)c1-c1cc2c(NC(C)(C)C(=O)C2(C)C)c2CCCc12 |(4.97,-.35,;4.72,-1.55,;5.75,-2.7,;4.97,-4.04,;3.46,-3.71,;2.54,-4.53,;3.33,-2.19,;2,-1.4,;.66,-2.11,;-.68,-1.4,;-.68,.15,;-2,.93,;-3.36,.15,;-4.42,-.49,;-3.33,1.38,;-3.36,-1.4,;-4.42,-2.03,;-2,-2.11,;-.91,-2.7,;-3.08,-2.71,;.66,.93,;.98,2.44,;2.53,2.61,;3.17,1.19,;2,.15,)|
Show InChI InChI=1S/C29H56O9/c1-3-4-5-6-7-8-9-10-11-12-13-14-15-16-17-18-19-36-21-23(35-2)22-37-29(34)38-28-25(31)20-24(30)26(32)27(28)33/h23-28,30-33H,3-22H2,1-2H3/t23-,24?,25?,26?,27?,28?/m1/s1
n/an/a 150n/an/an/an/an/an/a
TBA
Curated by ChEMBL
Assay Description
Antagonist activity at human glucocorticoid receptor transfected in CHOK1 cells assessed as inhibition of dexamethasone-induced receptor transcriptio...
J Med Chem 58: 4918-26 (2015)
Article DOI: 10.1021/jm501758q
BindingDB Entry DOI: 10.7270/Q2WM1G4V