BDBM50091151 (3-Chloro-benzyl)-[3-(2-chloro-phenothiazin-10-yl)-propyl]-dimethyl-ammonium (OFK004)::CHEMBL105785
SMILES: C[N+](C)(CCCN1c2ccccc2Sc2ccc(Cl)cc12)Cc1cccc(Cl)c1
InChI Key: InChIKey=DMRFUCYLTMVYCS-UHFFFAOYSA-N
Data: 1 KI  1 IC50
Activity Spreadsheet -- Enzyme Inhibition Constant Data from BindingDB
Found 2 hits for monomerid = 50091151
Trg + Lig
Ki
nM
ΔG°
kcal/mole
IC50
nM
Kd
nM
EC50/IC50
nM
koff
s-1
kon
M-1s-1
pHTemp
°C
Trypanothione reductase
(Trypanosoma cruzi)
BDBM50091151
((3-Chloro-benzyl)-[3-(2-chloro-phenothiazin-10-yl)...)
Show SMILES C[N+](C)(CCCN1c2ccccc2Sc2ccc(Cl)cc12)Cc1cccc(Cl)c1
Show InChI InChI=1S/C24H25Cl2N2S/c1-28(2,17-18-7-5-8-19(25)15-18)14-6-13-27-21-9-3-4-10-23(21)29-24-12-11-20(26)16-22(24)27/h3-5,7-12,15-16H,6,13-14,17H2,1-2H3/q+1
2.40E+3n/an/an/an/an/an/an/an/a
University of Manchester
Curated by ChEMBL
Assay Description
Inhibitory activity against Trypanosoma cruzi trypanothione reductase
J Med Chem 43: 3148-56 (2000)
BindingDB Entry DOI: 10.7270/Q2R78FXC
Trypanothione reductase
(Trypanosoma cruzi)
BDBM50091151
((3-Chloro-benzyl)-[3-(2-chloro-phenothiazin-10-yl)...)
Show SMILES C[N+](C)(CCCN1c2ccccc2Sc2ccc(Cl)cc12)Cc1cccc(Cl)c1
Show InChI InChI=1S/C24H25Cl2N2S/c1-28(2,17-18-7-5-8-19(25)15-18)14-6-13-27-21-9-3-4-10-23(21)29-24-12-11-20(26)16-22(24)27/h3-5,7-12,15-16H,6,13-14,17H2,1-2H3/q+1
n/an/a 6.60E+3n/an/an/an/an/an/a
University of Manchester
Curated by ChEMBL
Assay Description
Inhibitory activity against Trypanosoma cruzi trypanothione reductase
J Med Chem 43: 3148-56 (2000)
BindingDB Entry DOI: 10.7270/Q2R78FXC