BDBM50091162 (4-tert-Butyl-benzyl)-[3-(2-chloro-phenothiazin-10-yl)-propyl]-dimethyl-ammonium (OFK027)::CHEMBL107852
SMILES: CC(C)(C)c1ccc(C[N+](C)(C)CCCN2c3ccccc3Sc3ccc(Cl)cc23)cc1
InChI Key: InChIKey=XKNWWXYUMFBFGI-UHFFFAOYSA-N
Data: 1 KI  1 IC50
Activity Spreadsheet -- Enzyme Inhibition Constant Data from BindingDB
Found 2 hits for monomerid = 50091162
Trg + Lig
Ki
nM
ΔG°
kcal/mole
IC50
nM
Kd
nM
EC50/IC50
nM
koff
s-1
kon
M-1s-1
pHTemp
°C
Trypanothione reductase
(Trypanosoma cruzi)
BDBM50091162
((4-tert-Butyl-benzyl)-[3-(2-chloro-phenothiazin-10...)
Show SMILES CC(C)(C)c1ccc(C[N+](C)(C)CCCN2c3ccccc3Sc3ccc(Cl)cc23)cc1
Show InChI InChI=1S/C28H34ClN2S/c1-28(2,3)22-13-11-21(12-14-22)20-31(4,5)18-8-17-30-24-9-6-7-10-26(24)32-27-16-15-23(29)19-25(27)30/h6-7,9-16,19H,8,17-18,20H2,1-5H3/q+1
680n/an/an/an/an/an/an/an/a
University of Manchester
Curated by ChEMBL
Assay Description
Inhibitory activity against Trypanosoma cruzi trypanothione reductase
J Med Chem 43: 3148-56 (2000)
BindingDB Entry DOI: 10.7270/Q2R78FXC
Trypanothione reductase
(Trypanosoma cruzi)
BDBM50091162
((4-tert-Butyl-benzyl)-[3-(2-chloro-phenothiazin-10...)
Show SMILES CC(C)(C)c1ccc(C[N+](C)(C)CCCN2c3ccccc3Sc3ccc(Cl)cc23)cc1
Show InChI InChI=1S/C28H34ClN2S/c1-28(2,3)22-13-11-21(12-14-22)20-31(4,5)18-8-17-30-24-9-6-7-10-26(24)32-27-16-15-23(29)19-25(27)30/h6-7,9-16,19H,8,17-18,20H2,1-5H3/q+1
n/an/a 4.10E+3n/an/an/an/an/an/a
University of Manchester
Curated by ChEMBL
Assay Description
Inhibitory activity against Trypanosoma cruzi trypanothione reductase
J Med Chem 43: 3148-56 (2000)
BindingDB Entry DOI: 10.7270/Q2R78FXC