BDBM50091273 CHEMBL3582193
SMILES: N#Cc1cc2c(cn1)[nH]c1ncc(cc21)-c1ccoc1
InChI Key: InChIKey=KZSZKBQXNVVBFG-UHFFFAOYSA-N
Data: 1 IC50  1 EC50
Activity Spreadsheet -- Enzyme Inhibition Constant Data from BindingDB
Found 2 hits for monomerid = 50091273
Trg + Lig
Ki
nM
ΔG°
kcal/mole
IC50
nM
Kd
nM
EC50/IC50
nM
koff
s-1
kon
M-1s-1
pHTemp
°C
Serine/threonine-protein kinase Chk1
(Homo sapiens (Human))
BDBM50091273
(CHEMBL3582193)
Show SMILES N#Cc1cc2c(cn1)[nH]c1ncc(cc21)-c1ccoc1
Show InChI InChI=1S/C15H8N4O/c16-5-11-4-12-13-3-10(9-1-2-20-8-9)6-18-15(13)19-14(12)7-17-11/h1-4,6-8H,(H,18,19)
Reactome pathway
n/an/a 17n/an/an/an/an/an/a
Argenta Discovery Ltd.
Curated by ChEMBL
Assay Description
Inhibition of human recombinant Chk1 using biotinylated AKT substrate after 30 mins by Alphascreen biochemical assay
J Med Chem 58: 5053-74 (2015)
Article DOI: 10.1021/acs.jmedchem.5b00464
BindingDB Entry DOI: 10.7270/Q2HD7XC5
Serine/threonine-protein kinase Chk1
(Homo sapiens (Human))
BDBM50091273
(CHEMBL3582193)
Show SMILES N#Cc1cc2c(cn1)[nH]c1ncc(cc21)-c1ccoc1
Show InChI InChI=1S/C15H8N4O/c16-5-11-4-12-13-3-10(9-1-2-20-8-9)6-18-15(13)19-14(12)7-17-11/h1-4,6-8H,(H,18,19)
Reactome pathway
n/an/an/an/a 180n/an/an/an/a
Argenta Discovery Ltd.
Curated by ChEMBL
Assay Description
Inhibition of CHK1 in human HT29 cells assessed as phosphorylation of histone H3 after 24 hrs by checkpoint abrogation cellular assay
J Med Chem 58: 5053-74 (2015)
Article DOI: 10.1021/acs.jmedchem.5b00464
BindingDB Entry DOI: 10.7270/Q2HD7XC5