BDBM50091293 CHEMBL3582201
SMILES: N#Cc1cc2c(cn1)[nH]c1ncc(cc21)-c1ccc(CN2CCCCC2)cc1
InChI Key: InChIKey=PPYHOOZGDDPLKM-UHFFFAOYSA-N
Data: 2 IC50  1 EC50
PDB links: 1 PDB ID matches this monomer.
Activity Spreadsheet -- Enzyme Inhibition Constant Data from BindingDB
Found 3 hits for monomerid = 50091293
Trg + Lig
Ki
nM
ΔG°
kcal/mole
IC50
nM
Kd
nM
EC50/IC50
nM
koff
s-1
kon
M-1s-1
pHTemp
°C
Serine/threonine-protein kinase Chk1
(Homo sapiens (Human))
BDBM50091293
(CHEMBL3582201)
Show SMILES N#Cc1cc2c(cn1)[nH]c1ncc(cc21)-c1ccc(CN2CCCCC2)cc1
Show InChI InChI=1S/C23H21N5/c24-12-19-11-20-21-10-18(13-26-23(21)27-22(20)14-25-19)17-6-4-16(5-7-17)15-28-8-2-1-3-9-28/h4-7,10-11,13-14H,1-3,8-9,15H2,(H,26,27)
Reactome pathway
n/an/a 1n/an/an/an/an/an/a
Argenta Discovery Ltd.
Curated by ChEMBL
Assay Description
Inhibition of human recombinant Chk1 using biotinylated AKT substrate after 30 mins by Alphascreen biochemical assay
J Med Chem 58: 5053-74 (2015)
Article DOI: 10.1021/acs.jmedchem.5b00464
BindingDB Entry DOI: 10.7270/Q2HD7XC5
3D
3D Structure (crystal)
Serine/threonine-protein kinase Chk1
(Homo sapiens (Human))
BDBM50091293
(CHEMBL3582201)
Show SMILES N#Cc1cc2c(cn1)[nH]c1ncc(cc21)-c1ccc(CN2CCCCC2)cc1
Show InChI InChI=1S/C23H21N5/c24-12-19-11-20-21-10-18(13-26-23(21)27-22(20)14-25-19)17-6-4-16(5-7-17)15-28-8-2-1-3-9-28/h4-7,10-11,13-14H,1-3,8-9,15H2,(H,26,27)
Reactome pathway
n/an/an/an/a 53n/an/an/an/a
Argenta Discovery Ltd.
Curated by ChEMBL
Assay Description
Inhibition of CHK1 in human HT29 cells assessed as phosphorylation of histone H3 after 24 hrs by checkpoint abrogation cellular assay
J Med Chem 58: 5053-74 (2015)
Article DOI: 10.1021/acs.jmedchem.5b00464
BindingDB Entry DOI: 10.7270/Q2HD7XC5
3D
3D Structure (crystal)
Acetylcholinesterase
(Homo sapiens (Human))
BDBM50091293
(CHEMBL3582201)
Show SMILES N#Cc1cc2c(cn1)[nH]c1ncc(cc21)-c1ccc(CN2CCCCC2)cc1
Show InChI InChI=1S/C23H21N5/c24-12-19-11-20-21-10-18(13-26-23(21)27-22(20)14-25-19)17-6-4-16(5-7-17)15-28-8-2-1-3-9-28/h4-7,10-11,13-14H,1-3,8-9,15H2,(H,26,27)
NCI pathway
Reactome pathway
n/an/a 333n/an/an/an/an/an/a
Argenta Discovery Ltd.
Curated by ChEMBL
Assay Description
Inhibition of human acetylcholine esterase by horseradish peroxidase-coupled fluorescence assay
J Med Chem 58: 5053-74 (2015)
Article DOI: 10.1021/acs.jmedchem.5b00464
BindingDB Entry DOI: 10.7270/Q2HD7XC5