BDBM50091353 CHEMBL3582305
SMILES: CNC(=O)c1ccc(cc1F)-c1cnc2nnc(Cc3ccc4ncccc4c3)n2n1
InChI Key: InChIKey=AXBANCDWRYXEBP-UHFFFAOYSA-N
Data: 1 IC50
Activity Spreadsheet -- Enzyme Inhibition Constant Data from BindingDB
Found 1 hit for monomerid = 50091353
Trg + Lig
Ki
nM
ΔG°
kcal/mole
IC50
nM
Kd
nM
EC50/IC50
nM
koff
s-1
kon
M-1s-1
pHTemp
°C
Hepatocyte growth factor receptor
(Homo sapiens (Human))
BDBM50091353
(CHEMBL3582305)
Show SMILES CNC(=O)c1ccc(cc1F)-c1cnc2nnc(Cc3ccc4ncccc4c3)n2n1
Show InChI InChI=1S/C22H16FN7O/c1-24-21(31)16-6-5-15(11-17(16)23)19-12-26-22-28-27-20(30(22)29-19)10-13-4-7-18-14(9-13)3-2-8-25-18/h2-9,11-12H,10H2,1H3,(H,24,31)
n/an/a 0.130n/an/an/an/an/an/a
Shanghai Institute of Materia Medica
Curated by ChEMBL
Assay Description
Inhibition of C-Met (unknown origin) using polu (Glu,Tyr)4:1 substrate after 30 mins incubation by multi-well spectrophotometry
ACS Med Chem Lett 6: 507-12 (2015)
Article DOI: 10.1021/ml5004876
BindingDB Entry DOI: 10.7270/Q2QV3P79