BDBM50091382 CHEMBL324724::N-Hydroxy-4-[3-(1H-imidazol-4-yl)-propoxy]-benzamidine; compound with but-2-enedioic acid (0.5M H2O)
SMILES: ONC(=N)c1ccc(OCCCc2cnc[nH]2)cc1
InChI Key: InChIKey=DTFMFKVSKPPSGV-UHFFFAOYSA-N
Data: 1 KI  1 Kd
Activity Spreadsheet -- Enzyme Inhibition Constant Data from BindingDB
Found 2 hits for monomerid = 50091382
Trg + Lig
Ki
nM
ΔG°
kcal/mole
IC50
nM
Kd
nM
EC50/IC50
nM
koff
s-1
kon
M-1s-1
pHTemp
°C
Histamine H3 receptor
(Rattus norvegicus (rat))
BDBM50091382
(CHEMBL324724 | N-Hydroxy-4-[3-(1H-imidazol-4-yl)-p...)
Show SMILES ONC(=N)c1ccc(OCCCc2cnc[nH]2)cc1
Show InChI InChI=1S/C13H16N4O2/c14-13(17-18)10-3-5-12(6-4-10)19-7-1-2-11-8-15-9-16-11/h3-6,8-9,18H,1-2,7H2,(H2,14,17)(H,15,16)
Reactome pathway
0.460n/an/an/an/an/an/an/an/a
Freie Universität Berlin
Curated by ChEMBL
Assay Description
Histamine H3 receptor antagonist activity in an assay with K+ evoked depolarization-induced release of [3H]-histamine from rat synaptosomes.
J Med Chem 43: 3335-43 (2000)
BindingDB Entry DOI: 10.7270/Q2RR1XGV
Histamine H1 receptor
(Cavia porcellus (domestic guinea pig))
BDBM50091382
(CHEMBL324724 | N-Hydroxy-4-[3-(1H-imidazol-4-yl)-p...)
Show SMILES ONC(=N)c1ccc(OCCCc2cnc[nH]2)cc1
Show InChI InChI=1S/C13H16N4O2/c14-13(17-18)10-3-5-12(6-4-10)19-7-1-2-11-8-15-9-16-11/h3-6,8-9,18H,1-2,7H2,(H2,14,17)(H,15,16)
n/an/an/a>1.00E+5n/an/an/an/an/a
Freie Universität Berlin
Curated by ChEMBL
Assay Description
Histamine H1-receptor activity on isolated guinea pig ileum
J Med Chem 43: 3335-43 (2000)
BindingDB Entry DOI: 10.7270/Q2RR1XGV