BDBM50091503 CHEMBL3582339
SMILES: CCn1cc(cn1)[C@]1(N[C@H](Cc2c1[nH]c1ccccc21)c1nc(c[nH]1)-c1ccc(F)cn1)c1nn(CC)c(=O)o1
InChI Key:
Data: 3 IC50
Activity Spreadsheet -- Enzyme Inhibition Constant Data from BindingDB
Found 3 hits for monomerid = 50091503
Trg + Lig
Ki
nM
ΔG°
kcal/mole
IC50
nM
Kd
nM
EC50/IC50
nM
koff
s-1
kon
M-1s-1
pHTemp
°C
Somatostatin receptor type 3
(Homo sapiens (Human))
BDBM50091503
(CHEMBL3582339)
Show SMILES CCn1cc(cn1)[C@]1(N[C@H](Cc2c1[nH]c1ccccc21)c1nc(c[nH]1)-c1ccc(F)cn1)c1nn(CC)c(=O)o1 |r|
Reactome pathway
n/an/a 3n/an/an/an/an/an/a
Merck Research Laboratories
Curated by ChEMBL
Assay Description
Displacement of [125I]SS-14 from human recombinant SSTR3 expressed in CHO cell membranes incubated for 60 to 90 mins by radioligand binding assay
ACS Med Chem Lett 6: 513-7 (2015)
Article DOI: 10.1021/ml500514w
BindingDB Entry DOI: 10.7270/Q2M61N0H
Somatostatin receptor type 3
(Homo sapiens (Human))
BDBM50091503
(CHEMBL3582339)
Show SMILES CCn1cc(cn1)[C@]1(N[C@H](Cc2c1[nH]c1ccccc21)c1nc(c[nH]1)-c1ccc(F)cn1)c1nn(CC)c(=O)o1 |r|
Reactome pathway
n/an/a 0.400n/an/an/an/an/an/a
Merck Research Laboratories
Curated by ChEMBL
Assay Description
Antagonist activity against human recombinant SSTR3 expressed in CHO cells assessed as reduction in forskolin-induced cAMP accumulation in presence o...
ACS Med Chem Lett 6: 513-7 (2015)
Article DOI: 10.1021/ml500514w
BindingDB Entry DOI: 10.7270/Q2M61N0H
Potassium voltage-gated channel subfamily H member 2
(Homo sapiens (Human))
BDBM50091503
(CHEMBL3582339)
Show SMILES CCn1cc(cn1)[C@]1(N[C@H](Cc2c1[nH]c1ccccc21)c1nc(c[nH]1)-c1ccc(F)cn1)c1nn(CC)c(=O)o1 |r|
Reactome pathway
n/an/a 7.70E+3n/an/an/an/an/an/a
Merck Research Laboratories
Curated by ChEMBL
Assay Description
Inhibition of MK499 binding to human ERG
ACS Med Chem Lett 6: 513-7 (2015)
Article DOI: 10.1021/ml500514w
BindingDB Entry DOI: 10.7270/Q2M61N0H