BDBM50091599 4-(2,3-Dihydro-furo[2,3-b]pyridin-5-ylmethyl)-1-[2-hydroxy-4-(2-hydroxy-indan-1-ylcarbamoyl)-5-phenyl-pentyl]-piperazine-2-carboxylic acid tert-butylamide::CHEMBL325946
SMILES: CC(C)(C)NC(=O)[C@@H]1CN(Cc2cnc3OCCc3c2)CCN1C[C@@H](O)C[C@@H](Cc1ccccc1)C(=O)NC1[C@H](O)Cc2ccccc12
InChI Key: InChIKey=CFGOUUWGBUPZCL-GUFHCOKKSA-N
Data: 1 IC50
Activity Spreadsheet -- Enzyme Inhibition Constant Data from BindingDB
Found 1 hit for monomerid = 50091599
Trg + Lig
Ki
nM
ΔG°
kcal/mole
IC50
nM
Kd
nM
EC50/IC50
nM
koff
s-1
kon
M-1s-1
pHTemp
°C
Human immunodeficiency virus type 1 protease
(Human immunodeficiency virus type 1)
BDBM50091599
(4-(2,3-Dihydro-furo[2,3-b]pyridin-5-ylmethyl)-1-[2...)
Show SMILES CC(C)(C)NC(=O)[C@@H]1CN(Cc2cnc3OCCc3c2)CCN1C[C@@H](O)C[C@@H](Cc1ccccc1)C(=O)NC1[C@H](O)Cc2ccccc12
Show InChI InChI=1S/C38H49N5O5/c1-38(2,3)41-36(47)32-24-42(22-26-18-28-13-16-48-37(28)39-21-26)14-15-43(32)23-30(44)19-29(17-25-9-5-4-6-10-25)35(46)40-34-31-12-8-7-11-27(31)20-33(34)45/h4-12,18,21,29-30,32-34,44-45H,13-17,19-20,22-24H2,1-3H3,(H,40,46)(H,41,47)/t29-,30+,32+,33-,34?/m1/s1
n/an/a 0.680n/an/an/an/an/an/a
Merck Research Laboratories
Curated by ChEMBL
Assay Description
Inhibition of HIV-1 protease in vitro.
J Med Chem 43: 3386-99 (2000)
BindingDB Entry DOI: 10.7270/Q23J3DP4