BDBM50091883 (S)-3-Biphenyl-4-yl-2-{[1-((S)-2-mercapto-4-methylsulfanyl-butyrylamino)-cyclopentanecarbonyl]-amino}-propionic acid::CHEMBL61410
SMILES: CSCC[C@H](S)C(=O)NC1(CCCC1)C(=O)N[C@@H](Cc1ccc(cc1)-c1ccccc1)C(O)=O
InChI Key: InChIKey=VBTCEOFCVYGVOQ-VXKWHMMOSA-N
Data: 1 IC50
Activity Spreadsheet -- Enzyme Inhibition Constant Data from BindingDB
Found 1 hit for monomerid = 50091883
Trg + Lig
Ki
nM
ΔG°
kcal/mole
IC50
nM
Kd
nM
EC50/IC50
nM
koff
s-1
kon
M-1s-1
pHTemp
°C
Endothelin-converting enzyme 1 (ECE1)
(Homo sapiens (Human))
BDBM50091883
((S)-3-Biphenyl-4-yl-2-{[1-((S)-2-mercapto-4-methyl...)
Show SMILES CSCC[C@H](S)C(=O)NC1(CCCC1)C(=O)N[C@@H](Cc1ccc(cc1)-c1ccccc1)C(O)=O
Show InChI InChI=1S/C26H32N2O4S2/c1-34-16-13-22(33)23(29)28-26(14-5-6-15-26)25(32)27-21(24(30)31)17-18-9-11-20(12-10-18)19-7-3-2-4-8-19/h2-4,7-12,21-22,33H,5-6,13-17H2,1H3,(H,27,32)(H,28,29)(H,30,31)/t21-,22-/m0/s1
n/an/a 40n/an/an/an/an/an/a
Novartis Institute for Biomedical Research
Curated by ChEMBL
Assay Description
In vitro inhibition of human Endothelin converting Enzyme-1 activity
Bioorg Med Chem Lett 10: 2037-9 (2001)
BindingDB Entry DOI: 10.7270/Q2K35SW0