BDBM50091957 CHEMBL3582387
SMILES: Fc1ccc(NS(=O)(=O)c2cccnc2)c(F)c1C#Cc1cnc2[nH]ncc2c1
InChI Key: InChIKey=SSOPSBQSYPGIAA-UHFFFAOYSA-N
Data: 1 IC50
Activity Spreadsheet -- Enzyme Inhibition Constant Data from BindingDB
Found 1 hit for monomerid = 50091957
Trg + Lig
Ki
nM
ΔG°
kcal/mole
IC50
nM
Kd
nM
EC50/IC50
nM
koff
s-1
kon
M-1s-1
pHTemp
°C
Serine/threonine-protein kinase B-raf
(Homo sapiens (Human))
BDBM50091957
(CHEMBL3582387)
Show SMILES Fc1ccc(NS(=O)(=O)c2cccnc2)c(F)c1C#Cc1cnc2[nH]ncc2c1
Show InChI InChI=1S/C19H11F2N5O2S/c20-16-5-6-17(26-29(27,28)14-2-1-7-22-11-14)18(21)15(16)4-3-12-8-13-10-24-25-19(13)23-9-12/h1-2,5-11,26H,(H,23,24,25)
NCI pathway
Reactome pathway
n/an/a 51n/an/an/an/an/an/a
Guangzhou Institutes of Biomedicine and Health
Curated by ChEMBL
Assay Description
Inhibition of human recombinant B-Raf V600E mutant by FRET-based Z'-lyte assay
ACS Med Chem Lett 6: 543-7 (2015)
Article DOI: 10.1021/acsmedchemlett.5b00039
BindingDB Entry DOI: 10.7270/Q26W9CT5