BDBM50092059 CHEMBL3582407
SMILES: CCN(CC)c1ccc(\C=C(/C#N)C(O)=O)cc1
InChI Key: InChIKey=RAFCFNZBQHYJSO-UHFFFAOYSA-N
Data: 1 IC50
Activity Spreadsheet -- Enzyme Inhibition Constant Data from BindingDB
Found 1 hit for monomerid = 50092059
Trg + Lig
Ki
nM
ΔG°
kcal/mole
IC50
nM
Kd
nM
EC50/IC50
nM
koff
s-1
kon
M-1s-1
pHTemp
°C
Monocarboxylate transporter 1 (MCT1)
(Rattus norvegicus (Rat))
BDBM50092059
(CHEMBL3582407)
Show SMILES CCN(CC)c1ccc(\C=C(/C#N)C(O)=O)cc1
Show InChI InChI=1S/C16H12ClN3O4/c1-8(21)13-5-10-9(3-4-12(23-2)14(10)24-13)16(22)20-15-11(17)6-18-7-19-15/h3-7H,1-2H3,(H,18,19,20,22)
n/an/a 70n/an/an/an/an/an/a
Medical School Duluth
Curated by ChEMBL
Assay Description
Inhibition of MCT1-mediated lactate transport in rat RBE4 cells incubated for 15 mins by [14C]-lactate uptake assay
ACS Med Chem Lett 6: 558-61 (2015)
Article DOI: 10.1021/acsmedchemlett.5b00049
BindingDB Entry DOI: 10.7270/Q2ZC84MV