BDBM50092066 CHEMBL3582425
SMILES: [Na+].COc1cc(ccc1\C=C(/C#N)C([O-])=O)N1CCCC1
InChI Key: InChIKey=MPXKKKYXZROOTK-UHFFFAOYSA-N
Data: 1 IC50
Activity Spreadsheet -- Enzyme Inhibition Constant Data from BindingDB
Found 1 hit for monomerid = 50092066
Trg + Lig
Ki
nM
ΔG°
kcal/mole
IC50
nM
Kd
nM
EC50/IC50
nM
koff
s-1
kon
M-1s-1
pHTemp
°C
Monocarboxylate transporter 1 (MCT1)
(Rattus norvegicus (Rat))
BDBM50092066
(CHEMBL3582425)
Show SMILES [Na+].COc1cc(ccc1\C=C(/C#N)C([O-])=O)N1CCCC1
Show InChI InChI=1S/C18H14ClNO4/c1-10(21)16-9-12-11(7-8-15(23-2)17(12)24-16)18(22)20-14-6-4-3-5-13(14)19/h3-9H,1-2H3,(H,20,22)
n/an/a 48n/an/an/an/an/an/a
Medical School Duluth
Curated by ChEMBL
Assay Description
Inhibition of MCT1-mediated lactate transport in rat RBE4 cells incubated for 15 mins by [14C]-lactate uptake assay
ACS Med Chem Lett 6: 558-61 (2015)
Article DOI: 10.1021/acsmedchemlett.5b00049
BindingDB Entry DOI: 10.7270/Q2ZC84MV