BDBM50092076 CHEMBL3582415
SMILES: OC(=O)C(=C\c1ccc(cc1)N(c1ccccc1)c1ccccc1)\C#N
InChI Key: InChIKey=DTGGJUIFYJXAJI-OBGWFSINSA-N
Data: 1 IC50
Activity Spreadsheet -- Enzyme Inhibition Constant Data from BindingDB
Found 1 hit for monomerid = 50092076
Trg + Lig
Ki
nM
ΔG°
kcal/mole
IC50
nM
Kd
nM
EC50/IC50
nM
koff
s-1
kon
M-1s-1
pHTemp
°C
Monocarboxylate transporter 1 (MCT1)
(Rattus norvegicus (Rat))
BDBM50092076
(CHEMBL3582415)
Show SMILES OC(=O)C(=C\c1ccc(cc1)N(c1ccccc1)c1ccccc1)\C#N
Show InChI InChI=1S/C22H16N2O2/c23-16-18(22(25)26)15-17-11-13-21(14-12-17)24(19-7-3-1-4-8-19)20-9-5-2-6-10-20/h1-15H,(H,25,26)/b18-15+
n/an/a 30n/an/an/an/an/an/a
Medical School Duluth
Curated by ChEMBL
Assay Description
Inhibition of MCT1-mediated lactate transport in rat RBE4 cells incubated for 15 mins by [14C]-lactate uptake assay
ACS Med Chem Lett 6: 558-61 (2015)
Article DOI: 10.1021/acsmedchemlett.5b00049
BindingDB Entry DOI: 10.7270/Q2ZC84MV