null
SMILES: OC(=O)C(=C\c1ccc(cc1)N(CC=C)CC=C)\C#N
InChI Key: InChIKey=AISGAELWENFDCQ-SDNWHVSQSA-N
Activity Spreadsheet -- Enzyme Inhibition Constant Data from BindingDB
Found 2 hits for monomerid = 50092078
Trg + Lig
Ki
nM
ΔG°
kcal/mole
IC50
nM
Kd
nM
EC50/IC50
nM
koff
s-1
kon
M-1s-1
pHTemp
°C
Monocarboxylate transporter 1
(Rattus norvegicus (Rat))
BDBM50092078
(CHEMBL3582413 | US9296728, 7)
Show SMILES OC(=O)C(=C\c1ccc(cc1)N(CC=C)CC=C)\C#N
Show InChI InChI=1S/C16H16N2O2/c1-3-9-18(10-4-2)15-7-5-13(6-8-15)11-14(12-17)16(19)20/h3-8,11H,1-2,9-10H2,(H,19,20)/b14-11+
n/an/a 110n/an/an/an/an/an/a
Medical School Duluth
Curated by ChEMBL
Assay Description
Inhibition of MCT1-mediated lactate transport in rat RBE4 cells incubated for 15 mins by [14C]-lactate uptake assay
ACS Med Chem Lett 6: 558-61 (2015)
Article DOI: 10.1021/acsmedchemlett.5b00049
BindingDB Entry DOI: 10.7270/Q2ZC84MV
Monocarboxylate transporter 1
(Rattus norvegicus (Rat))
BDBM50092078
(CHEMBL3582413 | US9296728, 7)
Show SMILES OC(=O)C(=C\c1ccc(cc1)N(CC=C)CC=C)\C#N
Show InChI InChI=1S/C16H16N2O2/c1-3-9-18(10-4-2)15-7-5-13(6-8-15)11-14(12-17)16(19)20/h3-8,11H,1-2,9-10H2,(H,19,20)/b14-11+
US Patent
n/an/a 88n/an/an/an/a7.4337
Regents of the University of Minnesota
US Patent
Assay Description
The entire lactate uptake studies for the inhibition of MCT1 were carried out on RBE4 (Rat Brain Endothelial 4) cells. The expression of MCT1 on thes...
US Patent US9296728 (2016)
BindingDB Entry DOI: 10.7270/Q2KH0M5R