null
SMILES: O=C1C(c2c[nH]c3ccccc23)C(=O)C(=O)C(C1=O)c1ccccc1
InChI Key: InChIKey=JRNZALJNNGXWPG-UHFFFAOYSA-N
Activity Spreadsheet -- Enzyme Inhibition Constant Data from BindingDB
Found 1 hit for monomerid = 50092143
Trg + Lig
Ki
nM
ΔG°
kcal/mole
IC50
nM
Kd
nM
EC50/IC50
nM
koff
s-1
kon
M-1s-1
pHTemp
°C
Insulin receptor
(Homo sapiens (Human))
BDBM50092143
(2,5-Dihydroxy-3-(1H-indol-3-yl)-6-phenyl-[1,4]benz...)
Show SMILES O=C1C(c2c[nH]c3ccccc23)C(=O)C(=O)C(C1=O)c1ccccc1 |(7.38,-5.53,;7.38,-3.99,;6.05,-3.23,;4.72,-4,;5.21,-5.44,;3.97,-6.37,;2.74,-5.49,;1.22,-5.83,;.15,-4.69,;.61,-3.18,;2.15,-2.85,;3.2,-4,;6.05,-1.69,;4.72,-.92,;7.38,-.91,;7.38,.63,;8.71,-1.69,;8.71,-3.23,;10.04,-4,;10.04,-.92,;10.04,.62,;11.37,1.39,;12.72,.61,;12.7,-.93,;11.37,-1.69,)|
Show InChI InChI=1S/C20H13NO4/c22-17-15(11-6-2-1-3-7-11)18(23)20(25)16(19(17)24)13-10-21-14-9-5-4-8-12(13)14/h1-10,15-16,21H
n/an/an/an/a 300n/an/an/an/a
Merck Research Laboratories
Curated by ChEMBL
Assay Description
Activation of human insulin receptor tyrosine kinase (IRTK)
J Med Chem 43: 3487-94 (2000)
BindingDB Entry DOI: 10.7270/Q2NV9HHG