BDBM50092155 (4S,5R)-3-Oxo-4,5-diphenyl-pyrazolidine-1-carboxylic acid (4-bromo-phenyl)-amide::3-Oxo-4,5-diphenyl-pyrazolidine-1-carboxylic acid (4-bromo-phenyl)-amide(LY288513)::CHEMBL333081::LY-288513
SMILES: Brc1ccc(NC(=O)N2NC(=O)[C@H]([C@@H]2c2ccccc2)c2ccccc2)cc1
InChI Key: InChIKey=LMUQHXHWJWQXSD-PMACEKPBSA-N
Data: 6 IC50
Activity Spreadsheet -- Enzyme Inhibition Constant Data from BindingDB
Found 6 hits for monomerid = 50092155
Trg + Lig
Ki
nM
ΔG°
kcal/mole
IC50
nM
Kd
nM
EC50/IC50
nM
koff
s-1
kon
M-1s-1
pHTemp
°C
Gastrin/cholecystokinin type B receptor
(MOUSE)
BDBM50092155
((4S,5R)-3-Oxo-4,5-diphenyl-pyrazolidine-1-carboxyl...)
Show SMILES Brc1ccc(NC(=O)N2NC(=O)[C@H]([C@@H]2c2ccccc2)c2ccccc2)cc1
Show InChI InChI=1S/C22H18BrN3O2/c23-17-11-13-18(14-12-17)24-22(28)26-20(16-9-5-2-6-10-16)19(21(27)25-26)15-7-3-1-4-8-15/h1-14,19-20H,(H,24,28)(H,25,27)/t19-,20-/m0/s1
Reactome pathway
n/an/a 19n/an/an/an/a7.4n/a
TBA
Curated by ChEMBL
Assay Description
The compound was tested for its activity to inhibit the binding of [125I]-CCK-8 to Cholecystokinin type B receptor in mouse brain at a pH of 6.5
Bioorg Med Chem Lett 3: 875-880 (1993)
Article DOI: 10.1016/S0960-894X(00)80684-8
BindingDB Entry DOI: 10.7270/Q21C1WTM
Cholecystokinin receptor type A
(RAT)
BDBM50092155
((4S,5R)-3-Oxo-4,5-diphenyl-pyrazolidine-1-carboxyl...)
Show SMILES Brc1ccc(NC(=O)N2NC(=O)[C@H]([C@@H]2c2ccccc2)c2ccccc2)cc1
Show InChI InChI=1S/C22H18BrN3O2/c23-17-11-13-18(14-12-17)24-22(28)26-20(16-9-5-2-6-10-16)19(21(27)25-26)15-7-3-1-4-8-15/h1-14,19-20H,(H,24,28)(H,25,27)/t19-,20-/m0/s1
Reactome pathway
n/an/a 2.05E+4n/an/an/an/an/an/a
TBA
Curated by ChEMBL
Assay Description
The compound was tested for its activity to inhibit the binding of [3H]-L-364,718 to Cholecystokinin type A receptor in rat pancreas
Bioorg Med Chem Lett 3: 875-880 (1993)
Article DOI: 10.1016/S0960-894X(00)80684-8
BindingDB Entry DOI: 10.7270/Q21C1WTM
Gastrin/cholecystokinin type B receptor
(MOUSE)
BDBM50092155
((4S,5R)-3-Oxo-4,5-diphenyl-pyrazolidine-1-carboxyl...)
Show SMILES Brc1ccc(NC(=O)N2NC(=O)[C@H]([C@@H]2c2ccccc2)c2ccccc2)cc1
Show InChI InChI=1S/C22H18BrN3O2/c23-17-11-13-18(14-12-17)24-22(28)26-20(16-9-5-2-6-10-16)19(21(27)25-26)15-7-3-1-4-8-15/h1-14,19-20H,(H,24,28)(H,25,27)/t19-,20-/m0/s1
Reactome pathway
n/an/a 31n/an/an/an/a6.5n/a
TBA
Curated by ChEMBL
Assay Description
The compound was tested for its activity to inhibit the binding of [125I]-CCK-8 to Cholecystokinin type B receptor in mouse brain at a pH of 7.4
Bioorg Med Chem Lett 3: 875-880 (1993)
Article DOI: 10.1016/S0960-894X(00)80684-8
BindingDB Entry DOI: 10.7270/Q21C1WTM
Cholecystokinin receptor type A
(RAT)
BDBM50092155
((4S,5R)-3-Oxo-4,5-diphenyl-pyrazolidine-1-carboxyl...)
Show SMILES Brc1ccc(NC(=O)N2NC(=O)[C@H]([C@@H]2c2ccccc2)c2ccccc2)cc1
Show InChI InChI=1S/C22H18BrN3O2/c23-17-11-13-18(14-12-17)24-22(28)26-20(16-9-5-2-6-10-16)19(21(27)25-26)15-7-3-1-4-8-15/h1-14,19-20H,(H,24,28)(H,25,27)/t19-,20-/m0/s1
Reactome pathway
n/an/a 2.05E+4n/an/an/an/an/an/a
James Black Foundation
Curated by ChEMBL
Assay Description
Half maximal inhibition of specific binding of [125I]-Bolton-Hunter CCK-8 to Cholecystokinin type A receptor in the rat pancreas
J Med Chem 43: 3505-17 (2000)
BindingDB Entry DOI: 10.7270/Q2FQ9XBZ
Cholecystokinin receptor type A
(RAT)
BDBM50092155
((4S,5R)-3-Oxo-4,5-diphenyl-pyrazolidine-1-carboxyl...)
Show SMILES Brc1ccc(NC(=O)N2NC(=O)[C@H]([C@@H]2c2ccccc2)c2ccccc2)cc1
Show InChI InChI=1S/C22H18BrN3O2/c23-17-11-13-18(14-12-17)24-22(28)26-20(16-9-5-2-6-10-16)19(21(27)25-26)15-7-3-1-4-8-15/h1-14,19-20H,(H,24,28)(H,25,27)/t19-,20-/m0/s1
Reactome pathway
n/an/a 1.16E+4n/an/an/an/an/an/a
TBA
Curated by ChEMBL
Assay Description
The compound was tested for its activity to inhibit the binding of [3H]-L-364,718 to Cholecystokinin type A receptor in rat pancreas
Bioorg Med Chem Lett 3: 875-880 (1993)
Article DOI: 10.1016/S0960-894X(00)80684-8
BindingDB Entry DOI: 10.7270/Q21C1WTM
Gastrin/cholecystokinin type B receptor
(MOUSE)
BDBM50092155
((4S,5R)-3-Oxo-4,5-diphenyl-pyrazolidine-1-carboxyl...)
Show SMILES Brc1ccc(NC(=O)N2NC(=O)[C@H]([C@@H]2c2ccccc2)c2ccccc2)cc1
Show InChI InChI=1S/C22H18BrN3O2/c23-17-11-13-18(14-12-17)24-22(28)26-20(16-9-5-2-6-10-16)19(21(27)25-26)15-7-3-1-4-8-15/h1-14,19-20H,(H,24,28)(H,25,27)/t19-,20-/m0/s1
Reactome pathway
n/an/a 19n/an/an/an/an/an/a
James Black Foundation
Curated by ChEMBL
Assay Description
Half maximal inhibition of specific binding of [125I]Bolton-Hunter CCK-8 to Cholecystokinin type B receptor in the mouse cerebral cortex
J Med Chem 43: 3505-17 (2000)
BindingDB Entry DOI: 10.7270/Q2FQ9XBZ