BDBM50092235 5-[4-(2-Amino-phenoxy)-phenyl]-7-isopropyl-7H-pyrrolo[2,3-d]pyrimidin-4-ylamine::CHEMBL303195
SMILES: CC(C)n1cc(-c2ccc(Oc3ccccc3N)cc2)c2c(N)ncnc12
InChI Key: InChIKey=ITJWOPPSOKMWCK-UHFFFAOYSA-N
Data: 4 IC50
Activity Spreadsheet -- Enzyme Inhibition Constant Data from BindingDB
Found 4 hits for monomerid = 50092235
Trg + Lig
Ki
nM
ΔG°
kcal/mole
IC50
nM
Kd
nM
EC50/IC50
nM
koff
s-1
kon
M-1s-1
pHTemp
°C
Vascular endothelial growth factor receptor 2
(Homo sapiens (Human))
BDBM50092235
(5-[4-(2-Amino-phenoxy)-phenyl]-7-isopropyl-7H-pyrr...)
Show SMILES CC(C)n1cc(-c2ccc(Oc3ccccc3N)cc2)c2c(N)ncnc12
Show InChI InChI=1S/C21H21N5O/c1-13(2)26-11-16(19-20(23)24-12-25-21(19)26)14-7-9-15(10-8-14)27-18-6-4-3-5-17(18)22/h3-13H,22H2,1-2H3,(H2,23,24,25)
NCI pathway
Reactome pathway
n/an/a 3.30E+3n/an/an/an/an/an/a
BASF Bioresearch Corporation
Curated by ChEMBL
Assay Description
Inhibitory activity against vascular endothelial growth factor receptor 2 (VEGFR2) at a concentration of 5 microM ATP.
Bioorg Med Chem Lett 10: 2171-4 (2001)
BindingDB Entry DOI: 10.7270/Q2DB813K
Tyrosine-protein kinase Lck
(Homo sapiens (Human))
BDBM50092235
(5-[4-(2-Amino-phenoxy)-phenyl]-7-isopropyl-7H-pyrr...)
Show SMILES CC(C)n1cc(-c2ccc(Oc3ccccc3N)cc2)c2c(N)ncnc12
Show InChI InChI=1S/C21H21N5O/c1-13(2)26-11-16(19-20(23)24-12-25-21(19)26)14-7-9-15(10-8-14)27-18-6-4-3-5-17(18)22/h3-13H,22H2,1-2H3,(H2,23,24,25)
n/an/a 5n/an/an/an/an/an/a
BASF Bioresearch Corporation
Curated by ChEMBL
Assay Description
Inhibitory activity against p56 Lck tyrosine kinase at a concentration of 5 microM ATP.
Bioorg Med Chem Lett 10: 2171-4 (2001)
BindingDB Entry DOI: 10.7270/Q2DB813K
Tyrosine-protein kinase Lck
(Homo sapiens (Human))
BDBM50092235
(5-[4-(2-Amino-phenoxy)-phenyl]-7-isopropyl-7H-pyrr...)
Show SMILES CC(C)n1cc(-c2ccc(Oc3ccccc3N)cc2)c2c(N)ncnc12
Show InChI InChI=1S/C21H21N5O/c1-13(2)26-11-16(19-20(23)24-12-25-21(19)26)14-7-9-15(10-8-14)27-18-6-4-3-5-17(18)22/h3-13H,22H2,1-2H3,(H2,23,24,25)
n/an/a 150n/an/an/an/an/an/a
BASF Bioresearch Corporation
Curated by ChEMBL
Assay Description
Inhibition of p56 Lck tyrosine kinase (catalytic domain)
Bioorg Med Chem Lett 10: 2171-4 (2001)
BindingDB Entry DOI: 10.7270/Q2DB813K
Angiopoietin-1 receptor
(Homo sapiens (Human))
BDBM50092235
(5-[4-(2-Amino-phenoxy)-phenyl]-7-isopropyl-7H-pyrr...)
Show SMILES CC(C)n1cc(-c2ccc(Oc3ccccc3N)cc2)c2c(N)ncnc12
Show InChI InChI=1S/C21H21N5O/c1-13(2)26-11-16(19-20(23)24-12-25-21(19)26)14-7-9-15(10-8-14)27-18-6-4-3-5-17(18)22/h3-13H,22H2,1-2H3,(H2,23,24,25)
n/an/a 400n/an/an/an/an/an/a
BASF Bioresearch Corporation
Curated by ChEMBL
Assay Description
Inhibitory activity against tie-2 at a concentration of 5 microM ATP.
Bioorg Med Chem Lett 10: 2171-4 (2001)
BindingDB Entry DOI: 10.7270/Q2DB813K