BDBM50092399 3-(2-{[2-(2-Benzylcarbamoyl-acetylamino)-3-(1H-indol-3-yl)-propionyl]-methyl-amino}-hexanoylamino)-N-(1-carbamoyl-2-phenyl-ethyl)-succinamic acid::CHEMBL120827
SMILES: CCCC[C@H](N(C)C(=O)[C@H](Cc1c[nH]c2ccccc12)NC(=O)CC(=O)NCc1ccccc1)C(=O)N[C@@H](CC(O)=O)C(=O)N[C@@H](Cc1ccccc1)C(N)=O
InChI Key: InChIKey=CJJSLAZABBDCCM-CUPIEXAXSA-N
Data: 1 KI  1 EC50
Activity Spreadsheet -- Enzyme Inhibition Constant Data from BindingDB
Found 2 hits for monomerid = 50092399
Trg + Lig
Ki
nM
ΔG°
kcal/mole
IC50
nM
Kd
nM
EC50/IC50
nM
koff
s-1
kon
M-1s-1
pHTemp
°C
Cholecystokinin receptor
(Homo sapiens (Human))
BDBM50092399
(3-(2-{[2-(2-Benzylcarbamoyl-acetylamino)-3-(1H-ind...)
Show SMILES CCCC[C@H](N(C)C(=O)[C@H](Cc1c[nH]c2ccccc12)NC(=O)CC(=O)NCc1ccccc1)C(=O)N[C@@H](CC(O)=O)C(=O)N[C@@H](Cc1ccccc1)C(N)=O
Show InChI InChI=1S/C41H49N7O8/c1-3-4-19-34(40(55)47-32(22-37(51)52)39(54)46-31(38(42)53)20-26-13-7-5-8-14-26)48(2)41(56)33(21-28-25-43-30-18-12-11-17-29(28)30)45-36(50)23-35(49)44-24-27-15-9-6-10-16-27/h5-18,25,31-34,43H,3-4,19-24H2,1-2H3,(H2,42,53)(H,44,49)(H,45,50)(H,46,54)(H,47,55)(H,51,52)/t31-,32-,33-,34-/m0/s1
Reactome pathway
1.81n/an/an/an/an/an/an/an/a
INSERM
Curated by ChEMBL
Assay Description
Binding affinity against cholecystokinin type B receptor on guinea pig cortex.
J Med Chem 43: 3614-23 (2000)
BindingDB Entry DOI: 10.7270/Q2RN373C
CCKBR
(RAT)
BDBM50092399
(3-(2-{[2-(2-Benzylcarbamoyl-acetylamino)-3-(1H-ind...)
Show SMILES CCCC[C@H](N(C)C(=O)[C@H](Cc1c[nH]c2ccccc12)NC(=O)CC(=O)NCc1ccccc1)C(=O)N[C@@H](CC(O)=O)C(=O)N[C@@H](Cc1ccccc1)C(N)=O
Show InChI InChI=1S/C41H49N7O8/c1-3-4-19-34(40(55)47-32(22-37(51)52)39(54)46-31(38(42)53)20-26-13-7-5-8-14-26)48(2)41(56)33(21-28-25-43-30-18-12-11-17-29(28)30)45-36(50)23-35(49)44-24-27-15-9-6-10-16-27/h5-18,25,31-34,43H,3-4,19-24H2,1-2H3,(H2,42,53)(H,44,49)(H,45,50)(H,46,54)(H,47,55)(H,51,52)/t31-,32-,33-,34-/m0/s1
n/an/an/an/a 3.30n/an/an/an/a
INSERM
Curated by ChEMBL
Assay Description
Affinity against Cholecystokinin type B receptor expressed in CHO cells on rat brain.
J Med Chem 43: 3614-23 (2000)
BindingDB Entry DOI: 10.7270/Q2RN373C