null
SMILES: COc1ccccc1C(=O)NCCC1CCN(CC2COc3ccccc3O2)CC1
InChI Key: InChIKey=LGZRWXMJVFXJEV-UHFFFAOYSA-N
Activity Spreadsheet -- Enzyme Inhibition Constant Data from BindingDB
Found 1 hit for monomerid = 50092456
Trg + Lig
Ki
nM
ΔG°
kcal/mole
IC50
nM
Kd
nM
EC50/IC50
nM
koff
s-1
kon
M-1s-1
pHTemp
°C
D(2) dopamine receptor
(Rattus norvegicus (rat))
BDBM50092456
(CHEMBL120878 | N-{2-[1-(2,3-Dihydro-benzo[1,4]diox...)
Show SMILES COc1ccccc1C(=O)NCCC1CCN(CC2COc3ccccc3O2)CC1
Show InChI InChI=1S/C24H30N2O4/c1-28-21-7-3-2-6-20(21)24(27)25-13-10-18-11-14-26(15-12-18)16-19-17-29-22-8-4-5-9-23(22)30-19/h2-9,18-19H,10-17H2,1H3,(H,25,27)
Reactome pathway
n/an/a 24n/an/an/an/an/an/a
Centre de Recherche Pierre Fabre
Curated by ChEMBL
Assay Description
In vitro inhibition of specific binding of [3H]-YM 09151-2 to Dopamine receptor D2 site in rat striatal tissue.
J Med Chem 43: 3653-64 (2000)
BindingDB Entry DOI: 10.7270/Q2MW2GD3