BDBM50092552 4-Amino-5-chloro-2-methoxy-benzoic acid 2-(4-naphthalen-1-yl-piperazin-1-yl)-ethyl ester::CHEMBL122973
SMILES: COc1cc(N)c(Cl)cc1C(=O)OCCN1CCN(CC1)c1cccc2ccccc12
InChI Key: InChIKey=DVPUYYGAHQBZEY-UHFFFAOYSA-N
Data: 1 KI
Activity Spreadsheet -- Enzyme Inhibition Constant Data from BindingDB
Found 1 hit for monomerid = 50092552
Trg + Lig
Ki
nM
ΔG°
kcal/mole
IC50
nM
Kd
nM
EC50/IC50
nM
koff
s-1
kon
M-1s-1
pHTemp
°C
5-hydroxytryptamine receptor 4 (5-HT4)
(Homo sapiens (Human))
BDBM50092552
(4-Amino-5-chloro-2-methoxy-benzoic acid 2-(4-napht...)
Show SMILES COc1cc(N)c(Cl)cc1C(=O)OCCN1CCN(CC1)c1cccc2ccccc12
Show InChI InChI=1S/C24H26ClN3O3/c1-30-23-16-21(26)20(25)15-19(23)24(29)31-14-13-27-9-11-28(12-10-27)22-8-4-6-17-5-2-3-7-18(17)22/h2-8,15-16H,9-14,26H2,1H3
>1.00E+3n/an/an/an/an/an/an/an/a
INSERM
Curated by ChEMBL
Assay Description
Binding affinity was determined against cloned 5-hydroxytryptamine 4E receptor isoform expressed in C6 glial cells incubated with 0.2 nM [3H]-GR-113,...
J Med Chem 43: 3761-9 (2000)
BindingDB Entry DOI: 10.7270/Q2CC0ZXH