null
SMILES: COC(=O)c1ccc(cc1)C(N1CCNCC1)c1ccccc1
InChI Key: InChIKey=MGBUATLXUGLLFO-UHFFFAOYSA-N
Activity Spreadsheet -- Enzyme Inhibition Constant Data from BindingDB
Found 1 hit for monomerid = 50092697
Trg + Lig
Ki
nM
ΔG°
kcal/mole
IC50
nM
Kd
nM
EC50/IC50
nM
koff
s-1
kon
M-1s-1
pHTemp
°C
Delta-type opioid receptor
(Homo sapiens (Human))
BDBM50092697
(4-(Phenyl-piperazin-1-yl-methyl)-benzoic acid meth...)
Show SMILES COC(=O)c1ccc(cc1)C(N1CCNCC1)c1ccccc1
Show InChI InChI=1S/C19H22N2O2/c1-23-19(22)17-9-7-16(8-10-17)18(15-5-3-2-4-6-15)21-13-11-20-12-14-21/h2-10,18,20H,11-14H2,1H3
Reactome pathway
n/an/a 307n/an/an/an/an/an/a
AstraZeneca R&D Montreal
Curated by ChEMBL
Assay Description
Binding affinity against human opioid receptor delta 1 using [125I]-[D-Ala2]-deltorphin II as radioligand
J Med Chem 43: 3878-94 (2000)
BindingDB Entry DOI: 10.7270/Q2QN661W