BDBM50092870 2-Methyl-4-trifluoromethyl-pyrimidine-5-carboxylic acid (3,5-bis-trifluoromethyl-phenyl)-amide::CHEMBL441830
SMILES: Cc1ncc(C(=O)Nc2cc(cc(c2)C(F)(F)F)C(F)(F)F)c(n1)C(F)(F)F
InChI Key: InChIKey=MKMMEIWOWMMZFC-UHFFFAOYSA-N
Data: 1 IC50
Activity Spreadsheet -- Enzyme Inhibition Constant Data from BindingDB
Found 1 hit for monomerid = 50092870
Trg + Lig
Ki
nM
ΔG°
kcal/mole
IC50
nM
Kd
nM
EC50/IC50
nM
koff
s-1
kon
M-1s-1
pHTemp
°C
Transcription factor AP-1
(Homo sapiens (Human))
BDBM50092870
(2-Methyl-4-trifluoromethyl-pyrimidine-5-carboxylic...)
Show SMILES Cc1ncc(C(=O)Nc2cc(cc(c2)C(F)(F)F)C(F)(F)F)c(n1)C(F)(F)F
Show InChI InChI=1S/C15H8F9N3O/c1-6-25-5-10(11(26-6)15(22,23)24)12(28)27-9-3-7(13(16,17)18)2-8(4-9)14(19,20)21/h2-5H,1H3,(H,27,28)
n/an/a>1.00E+4n/an/an/an/an/an/a
Signal Pharmaceuticals, Inc.
Curated by ChEMBL
Assay Description
Concentration required to inhibit activator protein-1(AP-1) mediated transcriptional activation in human Jurkat T-cells
J Med Chem 43: 3995-4004 (2000)
BindingDB Entry DOI: 10.7270/Q26M363N