BDBM50093078 CHEMBL3586569
SMILES: CC(C)N1C(=O)CNc2ncc(nc12)-c1ccc(nc1C)-c1nc[nH]n1
InChI Key: InChIKey=PYBNTHVXUJFNOG-UHFFFAOYSA-N
Data: 2 IC50
Activity Spreadsheet -- Enzyme Inhibition Constant Data from BindingDB
Found 2 hits for monomerid = 50093078
Trg + Lig
Ki
nM
ΔG°
kcal/mole
IC50
nM
Kd
nM
EC50/IC50
nM
koff
s-1
kon
M-1s-1
pHTemp
°C
Mammalian target of Rapamycin (mTORC1)
(Homo sapiens (Human))
BDBM50093078
(CHEMBL3586569)
Show SMILES CC(C)N1C(=O)CNc2ncc(nc12)-c1ccc(nc1C)-c1nc[nH]n1
Show InChI InChI=1S/C17H18N8O/c1-9(2)25-14(26)7-19-16-17(25)23-13(6-18-16)11-4-5-12(22-10(11)3)15-20-8-21-24-15/h4-6,8-9H,7H2,1-3H3,(H,18,19)(H,20,21,24)
n/an/a 44n/an/an/an/an/an/a
Celgene Corporation
Curated by ChEMBL
Assay Description
Inhibition of mTORC1 in human PC3 cells assessed as inhibition of S6 phosphorylation after 1 hr
J Med Chem 58: 5599-608 (2015)
Article DOI: 10.1021/acs.jmedchem.5b00627
BindingDB Entry DOI: 10.7270/Q2BG2QRV
Serine/threonine-protein kinase mTOR
(Homo sapiens (Human))
BDBM50093078
(CHEMBL3586569)
Show SMILES CC(C)N1C(=O)CNc2ncc(nc12)-c1ccc(nc1C)-c1nc[nH]n1
Show InChI InChI=1S/C17H18N8O/c1-9(2)25-14(26)7-19-16-17(25)23-13(6-18-16)11-4-5-12(22-10(11)3)15-20-8-21-24-15/h4-6,8-9H,7H2,1-3H3,(H,18,19)(H,20,21,24)
NCI pathway
Reactome pathway
n/an/a 30n/an/an/an/an/an/a
Celgene Corporation
Curated by ChEMBL
Assay Description
Inhibition of mTOR (unknown origin) by HTR-FRET substrate phosphorylation assay
J Med Chem 58: 5599-608 (2015)
Article DOI: 10.1021/acs.jmedchem.5b00627
BindingDB Entry DOI: 10.7270/Q2BG2QRV