BDBM50093455 CHEMBL3586708
SMILES: CN(C)CC(C)(C)CNc1nccc2cc(C)c(=O)[nH]c12
InChI Key: InChIKey=QTYNQLMBIGVCBQ-VHKOTVLASA-N
Data: 2 IC50
Activity Spreadsheet -- Enzyme Inhibition Constant Data from BindingDB
Found 2 hits for monomerid = 50093455
Trg + Lig
Ki
nM
ΔG°
kcal/mole
IC50
nM
Kd
nM
EC50/IC50
nM
koff
s-1
kon
M-1s-1
pHTemp
°C
Bromodomain-containing protein 4
(Homo sapiens (Human))
BDBM50093455
(CHEMBL3586708)
Show SMILES CN(C)CC(C)(C)CNc1nccc2cc(C)c(=O)[nH]c12
Show InChI InChI=1S/C13H16N6O4/c1-2-3-15-10-7-11(18-13(14)17-10)19(5-16-7)12-9(22)8(21)6(4-20)23-12/h1,5-6,8-9,12,20-22H,3-4H2,(H3,14,15,17,18)/t6?,8-,9-,12?/m0/s1
n/an/a 1.58E+5n/an/an/an/an/an/a
GlaxoSmithKline
Curated by ChEMBL
Assay Description
Displacement of I-BET762 from 6His-Thr-BRD4 (1 to 477) BD1 (unknown origin) harboring BD2 Y390A mutant after 30 mins by TR-FRET analysis
J Med Chem 58: 5649-73 (2015)
Article DOI: 10.1021/acs.jmedchem.5b00772
BindingDB Entry DOI: 10.7270/Q2PR7XQN
ATPase family AAA domain-containing protein 2
(Homo sapiens (Human))
BDBM50093455
(CHEMBL3586708)
Show SMILES CN(C)CC(C)(C)CNc1nccc2cc(C)c(=O)[nH]c12
Show InChI InChI=1S/C13H16N6O4/c1-2-3-15-10-7-11(18-13(14)17-10)19(5-16-7)12-9(22)8(21)6(4-20)23-12/h1,5-6,8-9,12,20-22H,3-4H2,(H3,14,15,17,18)/t6?,8-,9-,12?/m0/s1
n/an/a<1.00E+5n/an/an/an/an/an/a
GlaxoSmithKline
Curated by ChEMBL
Assay Description
Displacement of histone H4 peptide from FLAG-6His-Tev-ATAD2 (981 to 1121) (unknown origin) expressed in Escherichia coli BL21 (DE3) after 30 mins by ...
J Med Chem 58: 5649-73 (2015)
Article DOI: 10.1021/acs.jmedchem.5b00772
BindingDB Entry DOI: 10.7270/Q2PR7XQN