BDBM50093465 CHEMBL3586692
SMILES: Cc1cc2cccc(NCCCO)c2[nH]c1=O
InChI Key: InChIKey=AICJVUAYBZJGAJ-AWKQRBDXSA-N
Data: 2 IC50
Activity Spreadsheet -- Enzyme Inhibition Constant Data from BindingDB
Found 2 hits for monomerid = 50093465
Trg + Lig
Ki
nM
ΔG°
kcal/mole
IC50
nM
Kd
nM
EC50/IC50
nM
koff
s-1
kon
M-1s-1
pHTemp
°C
ATPase family AAA domain-containing protein 2
(Homo sapiens (Human))
BDBM50093465
(CHEMBL3586692)
Show SMILES Cc1cc2cccc(NCCCO)c2[nH]c1=O
Show InChI InChI=1S/C19H24N6O4/c1-10(11-5-3-2-4-6-11)7-21-19-23-16(20)13-17(24-19)25(9-22-13)18-15(28)14(27)12(8-26)29-18/h2-6,9-10,12,14-15,18,26-28H,7-8H2,1H3,(H3,20,21,23,24)/t10?,12?,14-,15-,18?/m0/s1
n/an/a<1.00E+5n/an/an/an/an/an/a
GlaxoSmithKline
Curated by ChEMBL
Assay Description
Displacement of histone H4 peptide from FLAG-6His-Tev-ATAD2 (981 to 1121) (unknown origin) expressed in Escherichia coli BL21 (DE3) after 30 mins by ...
J Med Chem 58: 5649-73 (2015)
Article DOI: 10.1021/acs.jmedchem.5b00772
BindingDB Entry DOI: 10.7270/Q2PR7XQN
Bromodomain-containing protein 4
(Homo sapiens (Human))
BDBM50093465
(CHEMBL3586692)
Show SMILES Cc1cc2cccc(NCCCO)c2[nH]c1=O
Show InChI InChI=1S/C19H24N6O4/c1-10(11-5-3-2-4-6-11)7-21-19-23-16(20)13-17(24-19)25(9-22-13)18-15(28)14(27)12(8-26)29-18/h2-6,9-10,12,14-15,18,26-28H,7-8H2,1H3,(H3,20,21,23,24)/t10?,12?,14-,15-,18?/m0/s1
n/an/a 5.01E+3n/an/an/an/an/an/a
GlaxoSmithKline
Curated by ChEMBL
Assay Description
Displacement of I-BET762 from 6His-Thr-BRD4 (1 to 477) BD1 (unknown origin) harboring BD2 Y390A mutant after 30 mins by TR-FRET analysis
J Med Chem 58: 5649-73 (2015)
Article DOI: 10.1021/acs.jmedchem.5b00772
BindingDB Entry DOI: 10.7270/Q2PR7XQN