BDBM50093642 CHEMBL3278797
SMILES: COC(=O)[C@H](C)NC(=O)c1ccccc1N
InChI Key: InChIKey=KRWJCKHWSFDPIW-UHFFFAOYSA-N
Data: 2 IC50
Activity Spreadsheet -- Enzyme Inhibition Constant Data from BindingDB
Found 2 hits for monomerid = 50093642
Trg + Lig
Ki
nM
ΔG°
kcal/mole
IC50
nM
Kd
nM
EC50/IC50
nM
koff
s-1
kon
M-1s-1
pHTemp
°C
Monoamine oxidase B
(Bos taurus)
BDBM50093642
(CHEMBL3278797)
Show SMILES COC(=O)[C@H](C)NC(=O)c1ccccc1N |r|
Show InChI InChI=1S/C18H17F3N4/c1-10-22-15-9-14(11-7-12(19)16(21)13(20)8-11)24-17(15)18(23-10)25-5-3-2-4-6-25/h7-9,24H,2-6H2,1H3
Reactome pathway
n/an/a 4.10n/an/an/an/an/an/a
Alexandria University
Curated by ChEMBL
Assay Description
Inhibition of bovine brain mitochondria MAO-B using benzylamine substrate after 60 mins by fluorimetric method
Bioorg Med Chem 23: 3574-85 (2015)
Article DOI: 10.1016/j.bmc.2015.04.021
BindingDB Entry DOI: 10.7270/Q28K7BVZ
Monoamine oxidase A
(Bos taurus)
BDBM50093642
(CHEMBL3278797)
Show SMILES COC(=O)[C@H](C)NC(=O)c1ccccc1N |r|
Show InChI InChI=1S/C18H17F3N4/c1-10-22-15-9-14(11-7-12(19)16(21)13(20)8-11)24-17(15)18(23-10)25-5-3-2-4-6-25/h7-9,24H,2-6H2,1H3
Reactome pathway
n/an/a 6.30n/an/an/an/an/an/a
Alexandria University
Curated by ChEMBL
Assay Description
Inhibition of bovine brain mitochondria MAO-A using serotonin substrate after 60 mins by fluorimetric method
Bioorg Med Chem 23: 3574-85 (2015)
Article DOI: 10.1016/j.bmc.2015.04.021
BindingDB Entry DOI: 10.7270/Q28K7BVZ