null
SMILES: CCCCc1ccnc(c1)[C@H](CC1CCCCC1)NC(=O)CCCCN
InChI Key: InChIKey=AAKQJTJLPOJEEF-NRFANRHFSA-N
Activity Spreadsheet -- Enzyme Inhibition Constant Data from BindingDB
Found 1 hit for monomerid = 50093775
Trg + Lig
Ki
nM
ΔG°
kcal/mole
IC50
nM
Kd
nM
EC50/IC50
nM
koff
s-1
kon
M-1s-1
pHTemp
°C
B2 bradykinin receptor
(Homo sapiens (Human))
BDBM50093775
(5-Amino-pentanoic acid [(S)-1-(4-butyl-pyridin-2-y...)
Show SMILES CCCCc1ccnc(c1)[C@H](CC1CCCCC1)NC(=O)CCCCN
Show InChI InChI=1S/C22H37N3O/c1-2-3-9-19-13-15-24-20(16-19)21(17-18-10-5-4-6-11-18)25-22(26)12-7-8-14-23/h13,15-16,18,21H,2-12,14,17,23H2,1H3,(H,25,26)/t21-/m0/s1
n/an/an/a 6.20E+4n/an/an/an/an/a
Roche Bioscience
Curated by ChEMBL
Assay Description
Compound was assayed for binding against the human Bradykinin receptor B2 expressed in CHO cells
Bioorg Med Chem Lett 10: 2421-5 (2001)
BindingDB Entry DOI: 10.7270/Q20001BH