BDBM50093778 CHEMBL3585828
SMILES: NNC(=O)C(Cc1ccccc1)N1C(Nc2ccccc2C1=O)c1ccc(Cl)cc1
InChI Key: InChIKey=FBOWTUIAYIBXON-MWANZFMPSA-N
Data: 2 IC50
Activity Spreadsheet -- Enzyme Inhibition Constant Data from BindingDB
Found 2 hits for monomerid = 50093778
Trg + Lig
Ki
nM
ΔG°
kcal/mole
IC50
nM
Kd
nM
EC50/IC50
nM
koff
s-1
kon
M-1s-1
pHTemp
°C
Monoamine oxidase A
(Bos taurus)
BDBM50093778
(CHEMBL3585828)
Show SMILES NNC(=O)C(Cc1ccccc1)N1C(Nc2ccccc2C1=O)c1ccc(Cl)cc1
Show InChI InChI=1S/C15H21N6O9P/c16-6(1-2-8(22)23)15(26)30-31(27,28)3-7-10(24)11(25)14(29-7)21-5-20-9-12(17)18-4-19-13(9)21/h4-7,10-11,14,24-25H,1-3,16H2,(H,22,23)(H,27,28)(H2,17,18,19)/t6?,7-,10?,11?,14?/m0/s1
Reactome pathway
n/an/a 1.80n/an/an/an/an/an/a
Alexandria University
Curated by ChEMBL
Assay Description
Inhibition of bovine brain mitochondria MAO-A using serotonin substrate after 60 mins by fluorimetric method
Bioorg Med Chem 23: 3574-85 (2015)
Article DOI: 10.1016/j.bmc.2015.04.021
BindingDB Entry DOI: 10.7270/Q28K7BVZ
Monoamine oxidase B
(Bos taurus)
BDBM50093778
(CHEMBL3585828)
Show SMILES NNC(=O)C(Cc1ccccc1)N1C(Nc2ccccc2C1=O)c1ccc(Cl)cc1
Show InChI InChI=1S/C15H21N6O9P/c16-6(1-2-8(22)23)15(26)30-31(27,28)3-7-10(24)11(25)14(29-7)21-5-20-9-12(17)18-4-19-13(9)21/h4-7,10-11,14,24-25H,1-3,16H2,(H,22,23)(H,27,28)(H2,17,18,19)/t6?,7-,10?,11?,14?/m0/s1
Reactome pathway
n/an/a 1.20n/an/an/an/an/an/a
Alexandria University
Curated by ChEMBL
Assay Description
Inhibition of bovine brain mitochondria MAO-A using serotonin substrate after 60 mins by fluorimetric method
Bioorg Med Chem 23: 3574-85 (2015)
Article DOI: 10.1016/j.bmc.2015.04.021
BindingDB Entry DOI: 10.7270/Q28K7BVZ