BDBM50094492 CHEMBL3589024
SMILES: OC(=O)CCn1c2ccccc2c2nc3nonc3nc12
InChI Key: InChIKey=MCXYACOVFNQTGW-UHFFFAOYSA-N
Data: 2 KI  3 IC50
Activity Spreadsheet -- Enzyme Inhibition Constant Data from BindingDB
Found 5 hits for monomerid = 50094492
Trg + Lig
Ki
nM
ΔG°
kcal/mole
IC50
nM
Kd
nM
EC50/IC50
nM
koff
s-1
kon
M-1s-1
pHTemp
°C
Catenin beta-1
(Homo sapiens (Human))
BDBM50094492
(CHEMBL3589024)
Show SMILES OC(=O)CCn1c2ccccc2c2nc3nonc3nc12
Show InChI InChI=1S/C13H9N5O3/c19-9(20)5-6-18-8-4-2-1-3-7(8)10-13(18)15-12-11(14-10)16-21-17-12/h1-4H,5-6H2,(H,19,20)
NCI pathway
Reactome pathway
3.30E+3n/an/an/an/an/an/an/an/a
University of Utah
Curated by ChEMBL
Assay Description
Inhibition of N-terminally His6-tagged human beta-catenin (residues 138-686)/C-terminally biotinylated human Tcf4 (residues 7-51) interaction after 4...
J Med Chem 58: 4678-92 (2015)
Article DOI: 10.1021/acs.jmedchem.5b00223
BindingDB Entry DOI: 10.7270/Q2G44S28
Catenin beta-1
(Homo sapiens (Human))
BDBM50094492
(CHEMBL3589024)
Show SMILES OC(=O)CCn1c2ccccc2c2nc3nonc3nc12
Show InChI InChI=1S/C13H9N5O3/c19-9(20)5-6-18-8-4-2-1-3-7(8)10-13(18)15-12-11(14-10)16-21-17-12/h1-4H,5-6H2,(H,19,20)
NCI pathway
Reactome pathway
1.10E+4n/an/an/an/an/an/an/an/a
University of Utah
Curated by ChEMBL
Assay Description
Inhibition of human wild-type beta-catenin (residues 138-686)/C-terminally fluorescein labeled human wild-type Tcf4 (residues 7-51) interaction after...
J Med Chem 58: 4678-92 (2015)
Article DOI: 10.1021/acs.jmedchem.5b00223
BindingDB Entry DOI: 10.7270/Q2G44S28
Catenin beta-1
(Homo sapiens (Human))
BDBM50094492
(CHEMBL3589024)
Show SMILES OC(=O)CCn1c2ccccc2c2nc3nonc3nc12
Show InChI InChI=1S/C13H9N5O3/c19-9(20)5-6-18-8-4-2-1-3-7(8)10-13(18)15-12-11(14-10)16-21-17-12/h1-4H,5-6H2,(H,19,20)
NCI pathway
Reactome pathway
n/an/a 7.90E+5n/an/an/an/an/an/a
University of Utah
Curated by ChEMBL
Assay Description
Inhibition of human wild-type beta-catenin (residues 138-686)/C-terminally fluorescein-labeled human APC-R3 (residues 1477-1519) interaction by FP co...
J Med Chem 58: 4678-92 (2015)
Article DOI: 10.1021/acs.jmedchem.5b00223
BindingDB Entry DOI: 10.7270/Q2G44S28
Catenin beta-1
(Homo sapiens (Human))
BDBM50094492
(CHEMBL3589024)
Show SMILES OC(=O)CCn1c2ccccc2c2nc3nonc3nc12
Show InChI InChI=1S/C13H9N5O3/c19-9(20)5-6-18-8-4-2-1-3-7(8)10-13(18)15-12-11(14-10)16-21-17-12/h1-4H,5-6H2,(H,19,20)
NCI pathway
Reactome pathway
n/an/a 4.80E+4n/an/an/an/an/an/a
University of Utah
Curated by ChEMBL
Assay Description
Inhibition of human wild-type beta-catenin (residues 138-686)/C-terminally fluorescein labeled human wild-type Tcf4 (residues 7-51) interaction after...
J Med Chem 58: 4678-92 (2015)
Article DOI: 10.1021/acs.jmedchem.5b00223
BindingDB Entry DOI: 10.7270/Q2G44S28
Catenin beta-1
(Homo sapiens (Human))
BDBM50094492
(CHEMBL3589024)
Show SMILES OC(=O)CCn1c2ccccc2c2nc3nonc3nc12
Show InChI InChI=1S/C13H9N5O3/c19-9(20)5-6-18-8-4-2-1-3-7(8)10-13(18)15-12-11(14-10)16-21-17-12/h1-4H,5-6H2,(H,19,20)
NCI pathway
Reactome pathway
n/an/a 5.80E+5n/an/an/an/an/an/a
University of Utah
Curated by ChEMBL
Assay Description
Inhibition of human wild-type beta-catenin (residues 138-686)/C-terminally fluorescein-labeled human E-cadherin (residues 819-873) interaction by FP ...
J Med Chem 58: 4678-92 (2015)
Article DOI: 10.1021/acs.jmedchem.5b00223
BindingDB Entry DOI: 10.7270/Q2G44S28