BDBM50094555 5,6-Dimethyl-1,3-diphenyl-4,7-dihydro-2H-isoindole::CHEMBL343311
SMILES: CC1=C(C)Cc2c(C1)c([nH]c2-c1ccccc1)-c1ccccc1
InChI Key: InChIKey=GFJJQECNHHNDBI-UHFFFAOYSA-N
Data: 3 IC50
Activity Spreadsheet -- Enzyme Inhibition Constant Data from BindingDB
Found 3 hits for monomerid = 50094555
Trg + Lig
Ki
nM
ΔG°
kcal/mole
IC50
nM
Kd
nM
EC50/IC50
nM
koff
s-1
kon
M-1s-1
pHTemp
°C
Prostaglandin G/H synthase (cyclooxygenase)
(Mus musculus)
BDBM50094555
(5,6-Dimethyl-1,3-diphenyl-4,7-dihydro-2H-isoindole...)
Show SMILES CC1=C(C)Cc2c(C1)c([nH]c2-c1ccccc1)-c1ccccc1 |c:1|
Show InChI InChI=1S/C22H21N/c1-15-13-19-20(14-16(15)2)22(18-11-7-4-8-12-18)23-21(19)17-9-5-3-6-10-17/h3-12,23H,13-14H2,1-2H3
Reactome pathway
n/an/a>100n/an/an/an/an/an/a
Institut de Recherche Servier
Curated by ChEMBL
Assay Description
Inhibition against prostaglandin G/H synthase 1 from mouse resident macrophages
J Med Chem 43: 4582-93 (2001)
BindingDB Entry DOI: 10.7270/Q23B60T1
Cyclooxygenase-2 (COX-2)
(Mus musculus (Mouse))
BDBM50094555
(5,6-Dimethyl-1,3-diphenyl-4,7-dihydro-2H-isoindole...)
Show SMILES CC1=C(C)Cc2c(C1)c([nH]c2-c1ccccc1)-c1ccccc1 |c:1|
Show InChI InChI=1S/C22H21N/c1-15-13-19-20(14-16(15)2)22(18-11-7-4-8-12-18)23-21(19)17-9-5-3-6-10-17/h3-12,23H,13-14H2,1-2H3
n/an/a 14.5n/an/an/an/an/an/a
Dr HS Gour University
Curated by ChEMBL
Assay Description
Inhibition of mouse macrophage COX2
Eur J Med Chem 43: 1559-69 (2008)
Article DOI: 10.1016/j.ejmech.2007.09.028
BindingDB Entry DOI: 10.7270/Q2M909WP
Cyclooxygenase-2 (COX-2)
(Mus musculus (Mouse))
BDBM50094555
(5,6-Dimethyl-1,3-diphenyl-4,7-dihydro-2H-isoindole...)
Show SMILES CC1=C(C)Cc2c(C1)c([nH]c2-c1ccccc1)-c1ccccc1 |c:1|
Show InChI InChI=1S/C22H21N/c1-15-13-19-20(14-16(15)2)22(18-11-7-4-8-12-18)23-21(19)17-9-5-3-6-10-17/h3-12,23H,13-14H2,1-2H3
n/an/a 14.5n/an/an/an/an/an/a
Institut de Recherche Servier
Curated by ChEMBL
Assay Description
Inhibition against prostaglandin G/H synthase 2 from mouse resident macrophages
J Med Chem 43: 4582-93 (2001)
BindingDB Entry DOI: 10.7270/Q23B60T1