BDBM50094558 3,5-Diphenyl-4-aza-tricyclo[5.2.1.0*2,6*]deca-2,5-diene::CHEMBL341878
SMILES: C1CC2CC1c1c([nH]c(c21)-c1ccccc1)-c1ccccc1
InChI Key: InChIKey=GYWDQAIIDHAFSZ-UHFFFAOYSA-N
Data: 3 IC50
Activity Spreadsheet -- Enzyme Inhibition Constant Data from BindingDB
Found 3 hits for monomerid = 50094558
Trg + Lig
Ki
nM
ΔG°
kcal/mole
IC50
nM
Kd
nM
EC50/IC50
nM
koff
s-1
kon
M-1s-1
pHTemp
°C
Prostaglandin G/H synthase 1
(Mus musculus)
BDBM50094558
(3,5-Diphenyl-4-aza-tricyclo[5.2.1.0*2,6*]deca-2,5-...)
Show SMILES C1CC2CC1c1c([nH]c(c21)-c1ccccc1)-c1ccccc1
Show InChI InChI=1S/C21H19N/c1-3-7-14(8-4-1)20-18-16-11-12-17(13-16)19(18)21(22-20)15-9-5-2-6-10-15/h1-10,16-17,22H,11-13H2
Reactome pathway
n/an/a 100n/an/an/an/an/an/a
Institut de Recherche Servier
Curated by ChEMBL
Assay Description
Inhibition against prostaglandin G/H synthase 1 from mouse resident macrophages
J Med Chem 43: 4582-93 (2001)
BindingDB Entry DOI: 10.7270/Q23B60T1
Prostaglandin G/H synthase 2
(Mus musculus (Mouse))
BDBM50094558
(3,5-Diphenyl-4-aza-tricyclo[5.2.1.0*2,6*]deca-2,5-...)
Show SMILES C1CC2CC1c1c([nH]c(c21)-c1ccccc1)-c1ccccc1
Show InChI InChI=1S/C21H19N/c1-3-7-14(8-4-1)20-18-16-11-12-17(13-16)19(18)21(22-20)15-9-5-2-6-10-15/h1-10,16-17,22H,11-13H2
n/an/a 2.60n/an/an/an/an/an/a
Dr HS Gour University
Curated by ChEMBL
Assay Description
Inhibition of mouse macrophage COX2
Eur J Med Chem 43: 1559-69 (2008)
Article DOI: 10.1016/j.ejmech.2007.09.028
BindingDB Entry DOI: 10.7270/Q2M909WP
Prostaglandin G/H synthase 2
(Mus musculus (Mouse))
BDBM50094558
(3,5-Diphenyl-4-aza-tricyclo[5.2.1.0*2,6*]deca-2,5-...)
Show SMILES C1CC2CC1c1c([nH]c(c21)-c1ccccc1)-c1ccccc1
Show InChI InChI=1S/C21H19N/c1-3-7-14(8-4-1)20-18-16-11-12-17(13-16)19(18)21(22-20)15-9-5-2-6-10-15/h1-10,16-17,22H,11-13H2
n/an/a 2.60n/an/an/an/an/an/a
Institut de Recherche Servier
Curated by ChEMBL
Assay Description
Inhibition against prostaglandin G/H synthase 2 from mouse resident macrophages
J Med Chem 43: 4582-93 (2001)
BindingDB Entry DOI: 10.7270/Q23B60T1