BDBM50094641 CHEMBL422641::N-(4-Amino-2-methyl-quinolin-6-yl)-2-(4-amino-phenoxymethyl)-benzamide
SMILES: Cc1cc(N)c2cc(NC(=O)c3ccccc3COc3ccc(N)cc3)ccc2n1
InChI Key: InChIKey=PFIFPQFMXOXEOF-UHFFFAOYSA-N
Data: 1 KI
Activity Spreadsheet -- Enzyme Inhibition Constant Data from BindingDB
Found 1 hit for monomerid = 50094641
Trg + Lig
Ki
nM
ΔG°
kcal/mole
IC50
nM
Kd
nM
EC50/IC50
nM
koff
s-1
kon
M-1s-1
pHTemp
°C
Nociceptin receptor
(Homo sapiens (Human))
BDBM50094641
(CHEMBL422641 | N-(4-Amino-2-methyl-quinolin-6-yl)-...)
Show SMILES Cc1cc(N)c2cc(NC(=O)c3ccccc3COc3ccc(N)cc3)ccc2n1
Show InChI InChI=1S/C24H22N4O2/c1-15-12-22(26)21-13-18(8-11-23(21)27-15)28-24(29)20-5-3-2-4-16(20)14-30-19-9-6-17(25)7-10-19/h2-13H,14,25H2,1H3,(H2,26,27)(H,28,29)
Reactome pathway
82n/an/an/an/an/an/an/an/a
Central Pharmaceutical Research Institute
Curated by ChEMBL
Assay Description
Compound was evaluated for its ability to displace [3H]nociceptin ( 0.5 nM ) binding from Opioid receptor like 1 expressed in HeLa cells
J Med Chem 43: 4667-77 (2001)
BindingDB Entry DOI: 10.7270/Q2NK3D9H