BDBM50095148 CHEMBL3589535
SMILES: OC(=O)CC(=O)Nc1nc2CC[C@@H](Cc2s1)NC(=O)c1cc(Br)c(Br)[nH]1
InChI Key: InChIKey=QNZTYBLLVQDSEL-UHFFFAOYSA-N
Data: 3 IC50  1 Kd
Activity Spreadsheet -- Enzyme Inhibition Constant Data from BindingDB
Found 4 hits for monomerid = 50095148
Trg + Lig
Ki
nM
ΔG°
kcal/mole
IC50
nM
Kd
nM
EC50/IC50
nM
koff
s-1
kon
M-1s-1
pHTemp
°C
DNA Gyrase
(Escherichia coli (strain K12))
BDBM50095148
(CHEMBL3589535)
Show SMILES OC(=O)CC(=O)Nc1nc2CC[C@@H](Cc2s1)NC(=O)c1cc(Br)c(Br)[nH]1 |r|
Show InChI InChI=1S/C17H13N3O5/c21-13(22)4-8-2-1-3-10-11(8)6-12-15(10)19-17(25)16-18-9(5-14(23)24)7-20(12)16/h1-3,7H,4-6H2,(H,19,25)(H,21,22)(H,23,24)
n/an/a 69n/an/an/an/an/an/a
University of Ljubljana
Curated by ChEMBL
Assay Description
Inhibition of Escherichia coli DNA gyrase using relaxed pNO1 plasmid and biotinylated oligonucelotide incubated for 30 mins by fluorescence based DNA...
J Med Chem 58: 5501-21 (2015)
Article DOI: 10.1021/acs.jmedchem.5b00489
BindingDB Entry DOI: 10.7270/Q2MP551H
DNA Gyrase
(Escherichia coli (strain K12))
BDBM50095148
(CHEMBL3589535)
Show SMILES OC(=O)CC(=O)Nc1nc2CC[C@@H](Cc2s1)NC(=O)c1cc(Br)c(Br)[nH]1 |r|
Show InChI InChI=1S/C17H13N3O5/c21-13(22)4-8-2-1-3-10-11(8)6-12-15(10)19-17(25)16-18-9(5-14(23)24)7-20(12)16/h1-3,7H,4-6H2,(H,19,25)(H,21,22)(H,23,24)
n/an/an/a 42n/an/an/an/an/a
University of Ljubljana
Curated by ChEMBL
Assay Description
Binding affinity to Escherichia coli DNA gyrase subunit B N-terminal 24 kDa domain by SPR assay
J Med Chem 58: 5501-21 (2015)
Article DOI: 10.1021/acs.jmedchem.5b00489
BindingDB Entry DOI: 10.7270/Q2MP551H
Topoisomerase IV
(Staphylococcus aureus)
BDBM50095148
(CHEMBL3589535)
Show SMILES OC(=O)CC(=O)Nc1nc2CC[C@@H](Cc2s1)NC(=O)c1cc(Br)c(Br)[nH]1 |r|
Show InChI InChI=1S/C17H13N3O5/c21-13(22)4-8-2-1-3-10-11(8)6-12-15(10)19-17(25)16-18-9(5-14(23)24)7-20(12)16/h1-3,7H,4-6H2,(H,19,25)(H,21,22)(H,23,24)
n/an/a 7.60E+4n/an/an/an/an/an/a
University of Ljubljana
Curated by ChEMBL
Assay Description
Inhibition of Staphylococcus aureus DNA topoisomerase 4 using relaxed pNO1 plasmid and biotinylated oligonucelotide incubated for 30 mins by fluoresc...
J Med Chem 58: 5501-21 (2015)
Article DOI: 10.1021/acs.jmedchem.5b00489
BindingDB Entry DOI: 10.7270/Q2MP551H
DNA Gyrase
(Staphylococcus aureus)
BDBM50095148
(CHEMBL3589535)
Show SMILES OC(=O)CC(=O)Nc1nc2CC[C@@H](Cc2s1)NC(=O)c1cc(Br)c(Br)[nH]1 |r|
Show InChI InChI=1S/C17H13N3O5/c21-13(22)4-8-2-1-3-10-11(8)6-12-15(10)19-17(25)16-18-9(5-14(23)24)7-20(12)16/h1-3,7H,4-6H2,(H,19,25)(H,21,22)(H,23,24)
n/an/a 8.60E+4n/an/an/an/an/an/a
University of Ljubljana
Curated by ChEMBL
Assay Description
Inhibition of Staphylococcus aureus DNA gyrase using relaxed pNO1 plasmid and biotinylated oligonucelotide incubated for 30 mins by fluorescence base...
J Med Chem 58: 5501-21 (2015)
Article DOI: 10.1021/acs.jmedchem.5b00489
BindingDB Entry DOI: 10.7270/Q2MP551H