BDBM50095222 CHEMBL83209::N-Hydroxy-2-[4-(4-trifluoromethyl-phenoxy)-piperidine-1-sulfonyl]-benzamide::N-hydroxy-2-(4-(4-(trifluoromethyl)phenoxy)piperidin-1-ylsulfonyl)benzamide
SMILES: ONC(=O)c1ccccc1S(=O)(=O)N1CCC(CC1)Oc1ccc(cc1)C(F)(F)F
InChI Key: InChIKey=URNFYSXQOHQAJN-UHFFFAOYSA-N
Data: 5 IC50
Activity Spreadsheet -- Enzyme Inhibition Constant Data from BindingDB
Found 5 hits for monomerid = 50095222
Trg + Lig
Ki
nM
ΔG°
kcal/mole
IC50
nM
Kd
nM
EC50/IC50
nM
koff
s-1
kon
M-1s-1
pHTemp
°C
Interstitial collagenase
(Homo sapiens (Human))
BDBM50095222
(CHEMBL83209 | N-Hydroxy-2-[4-(4-trifluoromethyl-ph...)
Show SMILES ONC(=O)c1ccccc1S(=O)(=O)N1CCC(CC1)Oc1ccc(cc1)C(F)(F)F
Show InChI InChI=1S/C19H19F3N2O5S/c20-19(21,22)13-5-7-14(8-6-13)29-15-9-11-24(12-10-15)30(27,28)17-4-2-1-3-16(17)18(25)23-26/h1-8,15,26H,9-12H2,(H,23,25)
Reactome pathway
n/an/a>1.00E+4n/an/an/an/an/an/a
Pharmacia
Curated by ChEMBL
Assay Description
50 percent inhibition of human Matrix metalloprotease-1 by the cleavage of fluorogenic peptide MCA-Pro-Leu-Gly-Leu-Dpa-ala-Arg-NH2
Bioorg Med Chem Lett 10: 2815-7 (2000)
BindingDB Entry DOI: 10.7270/Q2ZK5H6Z
Collagenase 3
(Homo sapiens (Human))
BDBM50095222
(CHEMBL83209 | N-Hydroxy-2-[4-(4-trifluoromethyl-ph...)
Show SMILES ONC(=O)c1ccccc1S(=O)(=O)N1CCC(CC1)Oc1ccc(cc1)C(F)(F)F
Show InChI InChI=1S/C19H19F3N2O5S/c20-19(21,22)13-5-7-14(8-6-13)29-15-9-11-24(12-10-15)30(27,28)17-4-2-1-3-16(17)18(25)23-26/h1-8,15,26H,9-12H2,(H,23,25)
NCI pathway
Reactome pathway
n/an/a 28n/an/an/an/an/an/a
Pharmacia
Curated by ChEMBL
Assay Description
50 percent inhibition of human Matrix metalloprotease-13 by the cleavage of fluorogenic peptide MCA-Pro-Leu-Gly-Leu-Dpa-ala-Arg-NH2
Bioorg Med Chem Lett 10: 2815-7 (2000)
BindingDB Entry DOI: 10.7270/Q2ZK5H6Z
72 kDa type IV collagenase
(Homo sapiens (Human))
BDBM50095222
(CHEMBL83209 | N-Hydroxy-2-[4-(4-trifluoromethyl-ph...)
Show SMILES ONC(=O)c1ccccc1S(=O)(=O)N1CCC(CC1)Oc1ccc(cc1)C(F)(F)F
Show InChI InChI=1S/C19H19F3N2O5S/c20-19(21,22)13-5-7-14(8-6-13)29-15-9-11-24(12-10-15)30(27,28)17-4-2-1-3-16(17)18(25)23-26/h1-8,15,26H,9-12H2,(H,23,25)
Reactome pathway
n/an/a 1.30n/an/an/an/an/an/a
Indian Institute of Technology (BHU)
Curated by ChEMBL
Assay Description
Inhibition of MMP2 (unknown origin)
Eur J Med Chem 60: 89-100 (2013)
Article DOI: 10.1016/j.ejmech.2012.10.016
BindingDB Entry DOI: 10.7270/Q2MC91CR
Collagenase 3
(Homo sapiens (Human))
BDBM50095222
(CHEMBL83209 | N-Hydroxy-2-[4-(4-trifluoromethyl-ph...)
Show SMILES ONC(=O)c1ccccc1S(=O)(=O)N1CCC(CC1)Oc1ccc(cc1)C(F)(F)F
Show InChI InChI=1S/C19H19F3N2O5S/c20-19(21,22)13-5-7-14(8-6-13)29-15-9-11-24(12-10-15)30(27,28)17-4-2-1-3-16(17)18(25)23-26/h1-8,15,26H,9-12H2,(H,23,25)
NCI pathway
Reactome pathway
n/an/a 28n/an/an/an/an/an/a
Indian Institute of Technology (BHU)
Curated by ChEMBL
Assay Description
Inhibition of MMP13 (unknown origin)
Eur J Med Chem 60: 89-100 (2013)
Article DOI: 10.1016/j.ejmech.2012.10.016
BindingDB Entry DOI: 10.7270/Q2MC91CR
72 kDa type IV collagenase
(Homo sapiens (Human))
BDBM50095222
(CHEMBL83209 | N-Hydroxy-2-[4-(4-trifluoromethyl-ph...)
Show SMILES ONC(=O)c1ccccc1S(=O)(=O)N1CCC(CC1)Oc1ccc(cc1)C(F)(F)F
Show InChI InChI=1S/C19H19F3N2O5S/c20-19(21,22)13-5-7-14(8-6-13)29-15-9-11-24(12-10-15)30(27,28)17-4-2-1-3-16(17)18(25)23-26/h1-8,15,26H,9-12H2,(H,23,25)
Reactome pathway
n/an/a 1.30n/an/an/an/an/an/a
Pharmacia
Curated by ChEMBL
Assay Description
50 percent inhibition of human Matrix metalloprotease-2 by the cleavage of fluorogenic peptide MCA-Pro-Leu-Gly-Leu-Dpa-ala-Arg-NH2
Bioorg Med Chem Lett 10: 2815-7 (2000)
BindingDB Entry DOI: 10.7270/Q2ZK5H6Z