null
SMILES: CCn1ncc2c(C)cc(cc12)-c1ccc(c(=O)[nH]1)[C@@]1(C)CCNC1=O
InChI Key: InChIKey=JHDASKCSVXZNSZ-UHFFFAOYSA-N
Activity Spreadsheet -- Enzyme Inhibition Constant Data from BindingDB
Found 3 hits for monomerid = 50095293
Trg + Lig
Ki
nM
ΔG°
kcal/mole
IC50
nM
Kd
nM
EC50/IC50
nM
koff
s-1
kon
M-1s-1
pHTemp
°C
Prostaglandin E2 receptor EP3 subtype
(Homo sapiens (Human))
BDBM50095293
(CHEMBL3589085 | US9278953, 13)
Show SMILES CCn1ncc2c(C)cc(cc12)-c1ccc(c(=O)[nH]1)[C@@]1(C)CCNC1=O |r|
Show InChI InChI=1S/C18H18Cl2N4O/c1-3-6-22-18-13-7-11(25-2)4-5-12(13)17(23-24-18)8-14-15(19)9-21-10-16(14)20/h4-5,7,9-10H,3,6,8H2,1-2H3,(H,22,24)
5n/an/an/an/an/an/an/an/a
TBA
Citation and Details
Prostaglandin E2 receptor EP3 subtype
(Homo sapiens (Human))
BDBM50095293
(CHEMBL3589085 | US9278953, 13)
Show SMILES CCn1ncc2c(C)cc(cc12)-c1ccc(c(=O)[nH]1)[C@@]1(C)CCNC1=O |r|
Show InChI InChI=1S/C18H18Cl2N4O/c1-3-6-22-18-13-7-11(25-2)4-5-12(13)17(23-24-18)8-14-15(19)9-21-10-16(14)20/h4-5,7,9-10H,3,6,8H2,1-2H3,(H,22,24)
US Patent
31.6 -10.2n/an/an/an/an/a7.425
Pfizer Inc.
US Patent
Assay Description
Test compounds were half log serially diluted in 100% DMSO (J. T. Baker #922401). 1 uL of each compound was added to appropriate wells of a 384-well ...
US Patent US9278953 (2016)
BindingDB Entry DOI: 10.7270/Q2W37V5Z
Prostaglandin E2 receptor EP3 subtype
(Homo sapiens (Human))
BDBM50095293
(CHEMBL3589085 | US9278953, 13)
Show SMILES CCn1ncc2c(C)cc(cc12)-c1ccc(c(=O)[nH]1)[C@@]1(C)CCNC1=O |r|
Show InChI InChI=1S/C18H18Cl2N4O/c1-3-6-22-18-13-7-11(25-2)4-5-12(13)17(23-24-18)8-14-15(19)9-21-10-16(14)20/h4-5,7,9-10H,3,6,8H2,1-2H3,(H,22,24)
32n/an/an/an/an/an/an/an/a
Therachem Research Medilab (India) Pvt. Ltd.
Curated by ChEMBL
Assay Description
Displacement of [3H]PGE2 from human EP3 receptor by MicroBeta plate-based scintillation counting/SPA binding assay
ACS Med Chem Lett 6: 626-7 (2015)
Article DOI: 10.1021/acsmedchemlett.5b00188
BindingDB Entry DOI: 10.7270/Q2GX4D9S