BDBM50095347 CHEMBL3589037
SMILES: CNCCN(C)Cc1cn[nH]c1-c1cc(OCCC2CCCCC2)cc(c1)C(F)(F)F
InChI Key: InChIKey=GJDVMSRIXJKBKJ-UHFFFAOYSA-N
Data: 3 IC50
Activity Spreadsheet -- Enzyme Inhibition Constant Data from BindingDB
Found 3 hits for monomerid = 50095347
Trg + Lig
Ki
nM
ΔG°
kcal/mole
IC50
nM
Kd
nM
EC50/IC50
nM
koff
s-1
kon
M-1s-1
pHTemp
°C
Protein arginine N-methyltransferase 1 [11-371]
(Homo sapiens (Human))
BDBM50095347
(CHEMBL3589037)
Show SMILES CNCCN(C)Cc1cn[nH]c1-c1cc(OCCC2CCCCC2)cc(c1)C(F)(F)F
Show InChI InChI=1S/C23H33F3N4O/c1-27-9-10-30(2)16-19-15-28-29-22(19)18-12-20(23(24,25)26)14-21(13-18)31-11-8-17-6-4-3-5-7-17/h12-15,17,27H,3-11,16H2,1-2H3,(H,28,29)
n/an/a 14n/an/an/an/an/an/a
Epizyme, Inc.
Curated by ChEMBL
Assay Description
Inhibition of N-terminal GST tagged full-length human PRMT1 expressed in high five insect cells pre-incubated for 30 mins before addition of a [3H]SA...
ACS Med Chem Lett 6: 655-9 (2015)
Article DOI: 10.1021/acsmedchemlett.5b00071
BindingDB Entry DOI: 10.7270/Q20003V2
Protein arginine N-methyltransferase 6
(Homo sapiens (Human))
BDBM50095347
(CHEMBL3589037)
Show SMILES CNCCN(C)Cc1cn[nH]c1-c1cc(OCCC2CCCCC2)cc(c1)C(F)(F)F
Show InChI InChI=1S/C23H33F3N4O/c1-27-9-10-30(2)16-19-15-28-29-22(19)18-12-20(23(24,25)26)14-21(13-18)31-11-8-17-6-4-3-5-7-17/h12-15,17,27H,3-11,16H2,1-2H3,(H,28,29)
n/an/a 461n/an/an/an/an/an/a
Epizyme, Inc.
Curated by ChEMBL
Assay Description
Inhibition of FLAG and hexa-histidine tagged full-length human PRMT6 expressed in HEK293F cells pre-incubated for 30 mins before addition of a [3H]SA...
ACS Med Chem Lett 6: 655-9 (2015)
Article DOI: 10.1021/acsmedchemlett.5b00071
BindingDB Entry DOI: 10.7270/Q20003V2
Protein arginine N-methyltransferase 8
(Homo sapiens (Human))
BDBM50095347
(CHEMBL3589037)
Show SMILES CNCCN(C)Cc1cn[nH]c1-c1cc(OCCC2CCCCC2)cc(c1)C(F)(F)F
Show InChI InChI=1S/C23H33F3N4O/c1-27-9-10-30(2)16-19-15-28-29-22(19)18-12-20(23(24,25)26)14-21(13-18)31-11-8-17-6-4-3-5-7-17/h12-15,17,27H,3-11,16H2,1-2H3,(H,28,29)
n/an/a 21n/an/an/an/an/an/a
Epizyme, Inc.
Curated by ChEMBL
Assay Description
Inhibition of N-terminal GST tagged full-length human PRMT8 expressed in Escherichia coli (BL21(DE3) pre-incubated for 30 mins before addition of a [...
ACS Med Chem Lett 6: 655-9 (2015)
Article DOI: 10.1021/acsmedchemlett.5b00071
BindingDB Entry DOI: 10.7270/Q20003V2