BDBM50095390 5-tert-Butyl-3-(3-naphthalen-1-yl-ureido)-1H-pyrrole-2-carboxylic acid methyl ester::CHEMBL278924
SMILES: COC(=O)c1[nH]c(cc1NC(=O)Nc1cccc2ccccc12)C(C)(C)C
InChI Key: InChIKey=SYPDTJJRLTXCOA-UHFFFAOYSA-N
Data: 1 IC50
Activity Spreadsheet -- Enzyme Inhibition Constant Data from BindingDB
Found 1 hit for monomerid = 50095390
Trg + Lig
Ki
nM
ΔG°
kcal/mole
IC50
nM
Kd
nM
EC50/IC50
nM
koff
s-1
kon
M-1s-1
pHTemp
°C
Mitogen-activated protein kinase 14
(Homo sapiens (Human))
BDBM50095390
(5-tert-Butyl-3-(3-naphthalen-1-yl-ureido)-1H-pyrro...)
Show SMILES COC(=O)c1[nH]c(cc1NC(=O)Nc1cccc2ccccc12)C(C)(C)C
Show InChI InChI=1S/C21H23N3O3/c1-21(2,3)17-12-16(18(24-17)19(25)27-4)23-20(26)22-15-11-7-9-13-8-5-6-10-14(13)15/h5-12,24H,1-4H3,(H2,22,23,26)
NCI pathway
Reactome pathway
n/an/a 12n/an/an/an/an/an/a
Bayer Research Center
Curated by ChEMBL
Assay Description
In vitro inhibition of mitogen-activated protein kinase p38 alpha 2 derived from E. coli
Bioorg Med Chem Lett 11: 9-12 (2001)
BindingDB Entry DOI: 10.7270/Q2JM28WH