null
SMILES: CNC(=O)c1oc(cc1NC(=O)Nc1ccc(C)cc1)C(C)(C)C
InChI Key: InChIKey=SNAUIRUFYKOBGT-UHFFFAOYSA-N
Activity Spreadsheet -- Enzyme Inhibition Constant Data from BindingDB
Found 1 hit for monomerid = 50095402
Trg + Lig
Ki
nM
ΔG°
kcal/mole
IC50
nM
Kd
nM
EC50/IC50
nM
koff
s-1
kon
M-1s-1
pHTemp
°C
Mitogen-activated protein kinase 14
(Homo sapiens (Human))
BDBM50095402
(5-tert-Butyl-3-(3-p-tolyl-ureido)-furan-2-carboxyl...)
Show SMILES CNC(=O)c1oc(cc1NC(=O)Nc1ccc(C)cc1)C(C)(C)C
Show InChI InChI=1S/C18H23N3O3/c1-11-6-8-12(9-7-11)20-17(23)21-13-10-14(18(2,3)4)24-15(13)16(22)19-5/h6-10H,1-5H3,(H,19,22)(H2,20,21,23)
NCI pathway
Reactome pathway
n/an/a 32n/an/an/an/an/an/a
Bayer Research Center
Curated by ChEMBL
Assay Description
In vitro inhibition of mitogen-activated protein kinase p38 alpha 2 derived from E. coli
Bioorg Med Chem Lett 11: 9-12 (2001)
BindingDB Entry DOI: 10.7270/Q2JM28WH