BDBM50095407 5-tert-Butyl-3-[3-(4-chloro-phenyl)-ureido]-1H-pyrrole-2-carboxylic acid methyl ester::CHEMBL18743
SMILES: COC(=O)c1[nH]c(cc1NC(=O)Nc1ccc(Cl)cc1)C(C)(C)C
InChI Key: InChIKey=LDWUTNIBCYFOMA-UHFFFAOYSA-N
Data: 1 IC50
Activity Spreadsheet -- Enzyme Inhibition Constant Data from BindingDB
Found 1 hit for monomerid = 50095407
Trg + Lig
Ki
nM
ΔG°
kcal/mole
IC50
nM
Kd
nM
EC50/IC50
nM
koff
s-1
kon
M-1s-1
pHTemp
°C
Mitogen-activated protein kinase 14
(Homo sapiens (Human))
BDBM50095407
(5-tert-Butyl-3-[3-(4-chloro-phenyl)-ureido]-1H-pyr...)
Show SMILES COC(=O)c1[nH]c(cc1NC(=O)Nc1ccc(Cl)cc1)C(C)(C)C
Show InChI InChI=1S/C17H20ClN3O3/c1-17(2,3)13-9-12(14(21-13)15(22)24-4)20-16(23)19-11-7-5-10(18)6-8-11/h5-9,21H,1-4H3,(H2,19,20,23)
NCI pathway
Reactome pathway
n/an/a 43n/an/an/an/an/an/a
Bayer Research Center
Curated by ChEMBL
Assay Description
In vitro inhibition of mitogen-activated protein kinase p38 alpha 2 derived from E. coli
Bioorg Med Chem Lett 11: 9-12 (2001)
BindingDB Entry DOI: 10.7270/Q2JM28WH